{"text_format":"1","workbook":"xlsx","n_sheets":14,"sheets":["Preisteilnehmer","Teilereingabe","Ergebnisse","Ergebnisse Preisschießen","Eyendorf","Raven-Rolfsen","Soderstorf","Wetzen","Sammler","D","Orden u. Becher","Satzung","allgemeine Bedingungen","Preisgeldaufteilung"],"not_rendered":{"charts":0,"images":21,"macros":1,"external_links":0,"defined_names":8,"comments":4,"pivot_tables":0},"unopened":[],"bounds":{"document_bytes":16777216,"sheet_cells":100000,"rows_first":2000,"rows_last":500,"rows_between":2000,"halvings":0,"cell_chars":16384,"cell_head_chars":4096},"cells_cut":0,"cells_raw":0,"read":"whole","date_system":"1900"}

{"sheet":"Preisteilnehmer","index":0,"n_rows":107,"n_cols":8,"rows_kept":107,"cut":false,"hidden":false,"merged":[[0,3,0,4],[2,3,6,3],[2,4,6,4],[2,5,6,5],[4,6,4,7],[1,3,1,5],[6,6,6,7],[3,0,3,2],[4,1,4,2],[5,1,5,2]]}
[null,null,null,"© 2019, Rolf Marquardt, Soderstorf",null,"Version 1.6"]
[null,null,null,"Scheiben Verkauf für Preisschießen"]
[null,null,null,"lfd.\nNummer:","Vor- und Nachname:","Verein:","Einnahmen:","Preis pro Satz:"]
["Vier Vereineschießen in:",null,null,null,null,null,{"$f":"COUNTA(F8:F107)*H4","v":0},8]
["Ort:  ","???",null,null,null,null,"Preisgeld zur Verteilung"]
["Datum:  ","XX.XX.20XX",null,null,null,null,60,{"$f":"G4*G6/100","v":0}]
[]
[null,null,null,1]
[null,null,null,2]
[null,null,null,3]
{"$rows_left_out":98}
{"sheet":"Teilereingabe","index":1,"n_rows":202,"n_cols":7,"rows_kept":202,"cut":false,"hidden":false,"merged":[[1,3,1,6],[0,3,0,6]]}
[]
[null,null,null,"Eingabe Preisteiler:"]
[null,null,"lfd. Nr.","Start\nNummer:","Name:","Verein:","Teiler:"]
[null,null,1,null,{"$f":"IF(D4=\"\",\"\",VLOOKUP(D4,Preisteilnehmer!$D$7:$F$205,2))","v":""},{"$f":"IF(D4=\"\",\"\",VLOOKUP(D4,Preisteilnehmer!$D$7:$F$205,3))","v":""}]
[null,null,2,null,{"$f":"IF(D5=\"\",\"\",VLOOKUP(D5,Preisteilnehmer!$D$7:$F$205,2))","v":""},{"$f":"IF(D5=\"\",\"\",VLOOKUP(D5,Preisteilnehmer!$D$7:$F$205,3))","v":""}]
[null,null,3,null,{"$f":"IF(D6=\"\",\"\",VLOOKUP(D6,Preisteilnehmer!$D$7:$F$205,2))","v":""},{"$f":"IF(D6=\"\",\"\",VLOOKUP(D6,Preisteilnehmer!$D$7:$F$205,3))","v":""}]
[null,null,4,null,{"$f":"IF(D7=\"\",\"\",VLOOKUP(D7,Preisteilnehmer!$D$7:$F$205,2))","v":""},{"$f":"IF(D7=\"\",\"\",VLOOKUP(D7,Preisteilnehmer!$D$7:$F$205,3))","v":""}]
[null,null,5,null,{"$f":"IF(D8=\"\",\"\",VLOOKUP(D8,Preisteilnehmer!$D$7:$F$205,2))","v":""},{"$f":"IF(D8=\"\",\"\",VLOOKUP(D8,Preisteilnehmer!$D$7:$F$205,3))","v":""}]
[null,null,6,null,{"$f":"IF(D9=\"\",\"\",VLOOKUP(D9,Preisteilnehmer!$D$7:$F$205,2))","v":""},{"$f":"IF(D9=\"\",\"\",VLOOKUP(D9,Preisteilnehmer!$D$7:$F$205,3))","v":""}]
[null,null,7,null,{"$f":"IF(D10=\"\",\"\",VLOOKUP(D10,Preisteilnehmer!$D$7:$F$205,2))","v":""},{"$f":"IF(D10=\"\",\"\",VLOOKUP(D10,Preisteilnehmer!$D$7:$F$205,3))","v":""}]
{"$rows_left_out":193}
{"sheet":"Ergebnisse","index":2,"n_rows":47,"n_cols":9,"rows_kept":47,"cut":false,"hidden":false,"merged":[[42,2,42,5],[42,7,42,8],[44,2,44,5],[44,7,44,8],[45,2,45,5],[45,7,45,8],[46,2,46,5],[46,7,46,8],[39,2,39,5],[40,2,40,5],[41,2,41,5],[39,7,39,8],[40,7,40,8],[41,7,41,8],[37,7,37,8],[38,7,38,8],[31,4,31,5],[18,4,18,5],[24,4,24,5],[25,4,25,5],[38,2,38,5],[43,7,43,8],[2,0,3,8],[17,0,17,2],[11,0,11,2],[5,0,5,2],[4,0,4,7],[6,4,6,5],[30,4,30,5],[29,0,29,2],[23,0,23,2],[43,2,43,5],[7,4,7,5],[13,4,13,5],[19,4,19,5],[12,4,12,5],[37,2,37,5]]}
[]
[]
["Vier Vereineschießen"]
[]
[{"$f":"CONCATENATE(\"Ergebnisse vom\",\" \",Preisteilnehmer!B5,\" \",\"in\",\" \",Preisteilnehmer!B6)","v":"Ergebnisse vom ??? in XX.XX.20XX"}]
["Schützen Auflage"]
[null,"Verein :","Ringe :","M-Teiler:","Bester Einzelschütze :",null,"Verein :","Ringe :","Teiler:"]
["1.",{"$f":"D!A3","v":"Soderstorf keine Teilnahme"},{"$f":"D!B3","v":0},{"$f":"D!C3","v":0},{"$f":"D!G3","v":""},null,{"$f":"D!F3","v":""},{"$f":"D!H3","v":0},{"$f":"D!I3","v":""}]
["2.",{"$f":"D!A4","v":"Wetzen keine Teilnahme"},{"$f":"D!B4","v":0},{"$f":"D!C4","v":0}]
["3.",{"$f":"D!A5","v":"Eyendorf keine Teilnahme"},{"$f":"D!B5","v":0},{"$f":"D!C5","v":0}]
{"$rows_left_out":38}
{"sheet":"Ergebnisse Preisschießen","index":3,"n_rows":36,"n_cols":5,"rows_kept":36,"cut":false,"hidden":false,"merged":[[4,1,4,2],[0,1,0,2]]}
[null,"Vier-Vereine "]
[]
[]
[null,null,"Preisschießen"]
[null,{"$f":"CONCATENATE(Preisteilnehmer!G14,\" \",Preisteilnehmer!G15)","v":" "}]
[null,"Platz :","Name :","Teiler","Verein :"]
[null,{"$f":"IF(C7=\"\",\"\",\"1.)\")","v":""},{"$f":"IF(D!P3=\"\",\"\",D!P3)","v":""},{"$f":"IF(D!R3=\"\",\"\",D!R3)","v":""},{"$f":"IF(D!Q3=\"\",\"\",D!Q3)","v":""}]
[null,{"$f":"IF(C8=\"\",\"\",\"2.)\")","v":""},{"$f":"IF(D!P4=\"\",\"\",D!P4)","v":""},{"$f":"IF(D!R4=\"\",\"\",D!R4)","v":""},{"$f":"IF(D!Q4=\"\",\"\",D!Q4)","v":""}]
[null,{"$f":"IF(C9=\"\",\"\",\"3.)\")","v":""},{"$f":"IF(D!P5=\"\",\"\",D!P5)","v":""},{"$f":"IF(D!R5=\"\",\"\",D!R5)","v":""},{"$f":"IF(D!Q5=\"\",\"\",D!Q5)","v":""}]
[null,{"$f":"IF(C10=\"\",\"\",\"4.)\")","v":""},{"$f":"IF(D!P6=\"\",\"\",D!P6)","v":""},{"$f":"IF(D!R6=\"\",\"\",D!R6)","v":""},{"$f":"IF(D!Q6=\"\",\"\",D!Q6)","v":""}]
{"$rows_left_out":27}
{"sheet":"Eyendorf","index":4,"n_rows":56,"n_cols":16,"rows_kept":56,"cut":false,"hidden":false,"merged":[[17,0,17,13],[33,7,33,8],[42,2,42,5],[42,7,42,8],[35,0,35,13],[42,10,42,11],[33,10,33,11],[26,0,26,13],[24,2,24,5],[24,7,24,8],[24,10,24,11],[33,2,33,5],[0,0,0,12],[1,10,1,11],[15,10,15,11],[15,2,15,5],[15,7,15,8],[3,0,3,13],[1,2,1,5],[56,0,56,1],[53,2,53,3],[54,2,54,3],[55,2,55,3],[56,2,56,3],[44,0,44,13],[53,0,53,1],[54,0,54,1],[55,0,55,1],[51,2,51,5],[51,7,51,8],[51,10,51,11]]}
[{"$f":"\"Vier Vereineschießen in\"&\" \"&Preisteilnehmer!$B$5","v":"Vier Vereineschießen in ???"}]
[null,"Verein:","Eyendorf",null,null,null,null,null,null,null,"Datum:",null,{"$f":"Preisteilnehmer!$B$6","v":"XX.XX.20XX"},null,{"$f":"MAX(M6:M15)","v":0},{"$f":"INDEX(N6:N15,MATCH(O2&MIN(IF(M6:M15=O2,N6:N15)),M6:M15&N6:N15,0))","v":{"$error":"#N/A"}}]
[]
["Schützen Standauflage"]
[null,"Name:",1,2,3,4,5,6,7,8,9,10,"Summe:","Teiler"]
[1,null,null,null,null,null,null,null,null,null,null,null,{"$f":"IF(SUM(C6:L6)=0,\"\",SUM(C6:L6))","v":""}]
[2,null,null,null,null,null,null,null,null,null,null,null,""]
[3,null,null,null,null,null,null,null,null,null,null,null,""]
[4,null,null,null,null,null,null,null,null,null,null,null,""]
[5,null,null,null,null,null,null,null,null,null,null,null,""]
{"$rows_left_out":47}
{"sheet":"Raven-Rolfsen","index":5,"n_rows":56,"n_cols":16,"rows_kept":56,"cut":false,"hidden":false,"merged":[[51,10,51,11],[44,0,44,13],[51,2,51,5],[33,2,33,5],[33,7,33,8],[42,2,42,5],[42,7,42,8],[51,7,51,8],[42,10,42,11],[0,0,0,12],[1,10,1,11],[15,10,15,11],[15,2,15,5],[15,7,15,8],[3,0,3,13],[17,0,17,13],[26,0,26,13],[35,0,35,13],[1,2,1,5],[33,10,33,11],[24,2,24,5],[24,7,24,8],[24,10,24,11],[53,0,53,1],[54,0,54,1],[55,0,55,1],[56,0,56,1],[53,2,53,3],[54,2,54,3],[55,2,55,3],[56,2,56,3]]}
[{"$f":"\"Vier Vereineschießen in\"&\" \"&Preisteilnehmer!$B$5","v":"Vier Vereineschießen in ???"}]
[null,"Verein:","Raven - Rolfsen",null,null,null,null,null,null,null,"Datum:",null,{"$f":"Preisteilnehmer!$B$6","v":"XX.XX.20XX"},null,{"$f":"MAX(M6:M15)","v":0},{"$f":"INDEX(N6:N15,MATCH(O2&MIN(IF(M6:M15=O2,N6:N15)),M6:M15&N6:N15,0))","v":{"$error":"#N/A"}}]
[]
["Schützen Standauflage"]
[null,"Name:",1,2,3,4,5,6,7,8,9,10,"Summe:","Teiler"]
[1,null,null,null,null,null,null,null,null,null,null,null,{"$f":"IF(SUM(C6:L6)=0,\"\",SUM(C6:L6))","v":""}]
[2,null,null,null,null,null,null,null,null,null,null,null,""]
[3,null,null,null,null,null,null,null,null,null,null,null,""]
[4,null,null,null,null,null,null,null,null,null,null,null,""]
[5,null,null,null,null,null,null,null,null,null,null,null,""]
{"$rows_left_out":47}
{"sheet":"Soderstorf","index":6,"n_rows":56,"n_cols":16,"rows_kept":56,"cut":false,"hidden":false,"merged":[[17,0,17,13],[33,7,33,8],[42,2,42,5],[42,7,42,8],[35,0,35,13],[42,10,42,11],[33,10,33,11],[26,0,26,13],[24,2,24,5],[24,7,24,8],[24,10,24,11],[33,2,33,5],[0,0,0,12],[1,10,1,11],[15,10,15,11],[15,2,15,5],[15,7,15,8],[3,0,3,13],[1,2,1,5],[56,0,56,1],[53,2,53,3],[54,2,54,3],[55,2,55,3],[56,2,56,3],[44,0,44,13],[53,0,53,1],[54,0,54,1],[55,0,55,1],[51,2,51,5],[51,7,51,8],[51,10,51,11]]}
[{"$f":"\"Vier Vereineschießen in\"&\" \"&Preisteilnehmer!$B$5","v":"Vier Vereineschießen in ???"}]
[null,"Verein:","Soderstorf",null,null,null,null,null,null,null,"Datum:",null,{"$f":"Preisteilnehmer!$B$6","v":"XX.XX.20XX"},null,{"$f":"MAX(M6:M15)","v":0},{"$f":"INDEX(N6:N15,MATCH(O2&MIN(IF(M6:M15=O2,N6:N15)),M6:M15&N6:N15,0))","v":{"$error":"#N/A"}}]
[]
["Schützen Standauflage"]
[null,"Name:",1,2,3,4,5,6,7,8,9,10,"Summe:","Teiler"]
[1,null,null,null,null,null,null,null,null,null,null,null,{"$f":"IF(SUM(C6:L6)=0,\"\",SUM(C6:L6))","v":""}]
[2,null,null,null,null,null,null,null,null,null,null,null,""]
[3,null,null,null,null,null,null,null,null,null,null,null,""]
[4,null,null,null,null,null,null,null,null,null,null,null,""]
[5,null,null,null,null,null,null,null,null,null,null,null,""]
{"$rows_left_out":47}
{"sheet":"Wetzen","index":7,"n_rows":56,"n_cols":16,"rows_kept":56,"cut":false,"hidden":false,"merged":[[51,10,51,11],[44,0,44,13],[51,2,51,5],[33,2,33,5],[33,7,33,8],[42,2,42,5],[42,7,42,8],[51,7,51,8],[42,10,42,11],[0,0,0,12],[1,10,1,11],[15,10,15,11],[15,2,15,5],[15,7,15,8],[3,0,3,13],[17,0,17,13],[26,0,26,13],[35,0,35,13],[1,2,1,5],[33,10,33,11],[24,2,24,5],[24,7,24,8],[24,10,24,11],[53,0,53,1],[54,0,54,1],[55,0,55,1],[56,0,56,1],[53,2,53,3],[54,2,54,3],[55,2,55,3],[56,2,56,3]]}
[{"$f":"\"Vier Vereineschießen in\"&\" \"&Preisteilnehmer!$B$5","v":"Vier Vereineschießen in ???"}]
[null,"Verein:","Wetzen",null,null,null,null,null,null,null,"Datum:",null,{"$f":"Preisteilnehmer!$B$6","v":"XX.XX.20XX"},null,{"$f":"MAX(M6:M15)","v":0},{"$f":"INDEX(N6:N15,MATCH(O2&MIN(IF(M6:M15=O2,N6:N15)),M6:M15&N6:N15,0))","v":{"$error":"#N/A"}}]
[]
["Schützen Standauflage"]
[null,"Name:",1,2,3,4,5,6,7,8,9,10,"Summe:","Teiler"]
[1,null,null,null,null,null,null,null,null,null,null,null,{"$f":"IF(SUM(C6:L6)=0,\"\",SUM(C6:L6))","v":""}]
[2,null,null,null,null,null,null,null,null,null,null,null,""]
[3,null,null,null,null,null,null,null,null,null,null,null,""]
[4,null,null,null,null,null,null,null,null,null,null,null,""]
[5,null,null,null,null,null,null,null,null,null,null,null,""]
{"$rows_left_out":47}
{"sheet":"Sammler","index":8,"n_rows":101,"n_cols":18,"rows_kept":101,"cut":false,"hidden":false,"merged":[]}
["Ergebnisse pro Disziplin:",null,"Schützen Standauflage",null,"Bester Einzelschütze:",null,null,null,null,null,null,null,null,null,"Preisschießen"]
["Verein:","Ringe:","Teiler:",null,"Platz:","Verein:","Name:","Ringe:","Teiler:",null,"Königsschießen","Name:","Teiler",null,{"$f":"Teilereingabe!D3","v":"Start\nNummer:"},{"$f":"Teilereingabe!E3","v":"Name:"},{"$f":"Teilereingabe!F3","v":"Verein:"},{"$f":"Teilereingabe!G3","v":"Teiler:"}]
[{"$f":"IF(B3=0,\"Soderstorf keine Teilnahme\",\"Soderstorf\")","v":"Soderstorf keine Teilnahme"},{"$f":"IF(Soderstorf!$M$16=\"\",0,Soderstorf!$M$16)","v":0},{"$f":"Soderstorf!N16","v":0},null,"1.",{"$f":"IF(G3=\"\",\"\",\"Soderstorf\")","v":""},{"$f":"Soderstorf!$C$16","v":""},{"$f":"IF(Soderstorf!$G$16=\"\",0,Soderstorf!$G$16)","v":0},{"$f":"IF(ISERROR(Soderstorf!P2),\"\",Soderstorf!P2)","v":""},null,{"$f":"IF(L3=\"\",\"\",\"Soderstorf\")","v":""},{"$f":"IF(Soderstorf!$A$55=\"\",\"\",Soderstorf!$A$55)","v":""},{"$f":"IF(L3=\"\",\"\",Soderstorf!$C$55)","v":""},null,{"$f":"IF(Teilereingabe!D4=\"\",\"\",Teilereingabe!D4)","v":""},{"$f":"IF(Teilereingabe!E4=\"\",\"\",Teilereingabe!E4)","v":""},{"$f":"IF(Teilereingabe!F4=\"\",\"\",Teilereingabe!F4)","v":""},{"$f":"IF(Teilereingabe!G4=\"\",\"\",Teilereingabe!G4)","v":""}]
[{"$f":"IF(B4=0,\"Wetzen keine Teilnahme\",\"Wetzen\")","v":"Wetzen keine Teilnahme"},{"$f":"IF(Wetzen!$M$16=\"\",0,Wetzen!$M$16)","v":0},{"$f":"Wetzen!N16","v":0},null,"2.",{"$f":"IF(G4=\"\",\"\",\"Wetzen\")","v":""},{"$f":"Wetzen!$C$16","v":""},{"$f":"IF(Wetzen!$G$16=\"\",0,Wetzen!$G$16)","v":0},{"$f":"IF(ISERROR(Wetzen!P2),\"\",Wetzen!P2)","v":""},null,{"$f":"IF(L4=\"\",\"\",\"Wetzen\")","v":""},{"$f":"IF(Wetzen!$A$55=\"\",\"\",Wetzen!$A$55)","v":""},{"$f":"IF(L4=\"\",\"\",Wetzen!$C$55)","v":""},null,{"$f":"IF(Teilereingabe!D5=\"\",\"\",Teilereingabe!D5)","v":""},{"$f":"IF(Teilereingabe!E5=\"\",\"\",Teilereingabe!E5)","v":""},{"$f":"IF(Teilereingabe!F5=\"\",\"\",Teilereingabe!F5)","v":""},{"$f":"IF(Teilereingabe!G5=\"\",\"\",Teilereingabe!G5)","v":""}]
[{"$f":"IF(B5=0,\"Eyendorf keine Teilnahme\",\"Eyendorf\")","v":"Eyendorf keine Teilnahme"},{"$f":"IF(Eyendorf!$M$16=\"\",0,Eyendorf!$M$16)","v":0},{"$f":"Eyendorf!N16","v":0},null,"3.",{"$f":"IF(G5=\"\",\"\",\"Eyendorf\")","v":""},{"$f":"Eyendorf!$C$16","v":""},{"$f":"IF(Eyendorf!$G$16=\"\",0,Eyendorf!$G$16)","v":0},{"$f":"IF(ISERROR(Eyendorf!P2),\"\",Eyendorf!P2)","v":""},null,{"$f":"IF(L5=\"\",\"\",\"Eyendorf\")","v":""},{"$f":"IF(Eyendorf!$A$55=\"\",\"\",Eyendorf!$A$55)","v":""},{"$f":"IF(L5=\"\",\"\",Eyendorf!$C$55)","v":""},null,{"$f":"IF(Teilereingabe!D6=\"\",\"\",Teilereingabe!D6)","v":""},{"$f":"IF(Teilereingabe!E6=\"\",\"\",Teilereingabe!E6)","v":""},{"$f":"IF(Teilereingabe!F6=\"\",\"\",Teilereingabe!F6)","v":""},{"$f":"IF(Teilereingabe!G6=\"\",\"\",Teilereingabe!G6)","v":""}]
[{"$f":"IF(B6=0,\"Raven-Rolfsen keine Teilnahme\",\"Raven-Rolfsen\")","v":"Raven-Rolfsen keine Teilnahme"},{"$f":"IF('Raven-Rolfsen'!$M$16=\"\",0,'Raven-Rolfsen'!$M$16)","v":0},{"$f":"'Raven-Rolfsen'!N16","v":0},null,"4.",{"$f":"IF(G6=\"\",\"\",\"Raven-Rolfsen\")","v":""},{"$f":"'Raven-Rolfsen'!$C$16","v":""},{"$f":"IF('Raven-Rolfsen'!$G$16=\"\",0,'Raven-Rolfsen'!$G$16)","v":0},{"$f":"IF(ISERROR('Raven-Rolfsen'!P2),\"\",'Raven-Rolfsen'!P2)","v":""},null,{"$f":"IF(L6=\"\",\"\",\"Raven-Rolfsen\")","v":""},{"$f":"IF('Raven-Rolfsen'!$A$55=\"\",\"\",'Raven-Rolfsen'!$A$55)","v":""},{"$f":"IF(L6=\"\",\"\",'Raven-Rolfsen'!$C$55)","v":""},null,{"$f":"IF(Teilereingabe!D7=\"\",\"\",Teilereingabe!D7)","v":""},{"$f":"IF(Teilereingabe!E7=\"\",\"\",Teilereingabe!E7)","v":""},{"$f":"IF(Teilereingabe!F7=\"\",\"\",Teilereingabe!F7)","v":""},{"$f":"IF(Teilereingabe!G7=\"\",\"\",Teilereingabe!G7)","v":""}]
[null,null,null,null,null,null,null,null,null,null,null,null,null,null,{"$f":"IF(Teilereingabe!D8=\"\",\"\",Teilereingabe!D8)","v":""},{"$f":"IF(Teilereingabe!E8=\"\",\"\",Teilereingabe!E8)","v":""},{"$f":"IF(Teilereingabe!F8=\"\",\"\",Teilereingabe!F8)","v":""},{"$f":"IF(Teilereingabe!G8=\"\",\"\",Teilereingabe!G8)","v":""}]
[null,null,"Damen",null,null,null,null,null,null,null,null,null,null,null,{"$f":"IF(Teilereingabe!D9=\"\",\"\",Teilereingabe!D9)","v":""},{"$f":"IF(Teilereingabe!E9=\"\",\"\",Teilereingabe!E9)","v":""},{"$f":"IF(Teilereingabe!F9=\"\",\"\",Teilereingabe!F9)","v":""},{"$f":"IF(Teilereingabe!G9=\"\",\"\",Teilereingabe!G9)","v":""}]
[{"$f":"IF(B9=0,\"Soderstorf keine Teilnahme\",\"Soderstorf\")","v":"Soderstorf keine Teilnahme"},{"$f":"IF(Soderstorf!$M$25=\"\",0,Soderstorf!$M$25)","v":0},{"$f":"Soderstorf!N25","v":0},null,"1.",{"$f":"IF(G9=\"\",\"\",\"Soderstorf\")","v":""},{"$f":"Soderstorf!$C$25","v":""},{"$f":"IF(Soderstorf!$G$25=\"\",0,Soderstorf!$G$25)","v":0},{"$f":"IF(ISERROR(Soderstorf!P18),\"\",Soderstorf!P18)","v":""},null,"Königinenschießen","Name:","Teiler",null,{"$f":"IF(Teilereingabe!D10=\"\",\"\",Teilereingabe!D10)","v":""},{"$f":"IF(Teilereingabe!E10=\"\",\"\",Teilereingabe!E10)","v":""},{"$f":"IF(Teilereingabe!F10=\"\",\"\",Teilereingabe!F10)","v":""},{"$f":"IF(Teilereingabe!G10=\"\",\"\",Teilereingabe!G10)","v":""}]
[{"$f":"IF(B10=0,\"Wetzen keine Teilnahme\",\"Wetzen\")","v":"Wetzen keine Teilnahme"},{"$f":"IF(Wetzen!$M$25=\"\",0,Wetzen!$M$25)","v":0},{"$f":"Wetzen!N25","v":0},null,"2.",{"$f":"IF(G10=\"\",\"\",\"Wetzen\")","v":""},{"$f":"Wetzen!$C$25","v":""},{"$f":"IF(Wetzen!$G$25=\"\",0,Wetzen!$G$25)","v":0},{"$f":"IF(ISERROR(Wetzen!P18),\"\",Wetzen!P18)","v":""},null,{"$f":"IF(L10=\"\",\"\",\"Soderstorf\")","v":""},{"$f":"IF(Soderstorf!$A$57=\"\",\"\",Soderstorf!$A$57)","v":""},{"$f":"IF(L10=\"\",\"\",Soderstorf!$C$57)","v":""},null,{"$f":"IF(Teilereingabe!D11=\"\",\"\",Teilereingabe!D11)","v":""},{"$f":"IF(Teilereingabe!E11=\"\",\"\",Teilereingabe!E11)","v":""},{"$f":"IF(Teilereingabe!F11=\"\",\"\",Teilereingabe!F11)","v":""},{"$f":"IF(Teilereingabe!G11=\"\",\"\",Teilereingabe!G11)","v":""}]
{"$rows_left_out":92}
{"sheet":"D","index":9,"n_rows":101,"n_cols":18,"rows_kept":101,"cut":false,"hidden":false,"merged":[]}
["Ergebnisse pro Disziplin:",null,"Schützen Standauflage",null,"Bester Einzelschütze:",null,null,null,null,null,null,null,null,null,"Preisschießen"]
["Verein:","Ringe:","Teiler:",null,"Platz:","Verein:","Name:","Ringe:","Teiler:",null,"Königsschießen","Name:","Teiler",null,"Start\nNummer:","Name:","Verein:","Teiler:"]
["Soderstorf keine Teilnahme",0,0,null,"1.","","",0,"",null,"","","",null,"","","",""]
["Wetzen keine Teilnahme",0,0,null,"2.","","",0,"",null,"","","",null,"","","",""]
["Eyendorf keine Teilnahme",0,0,null,"3.","","",0,"",null,"","","",null,"","","",""]
["Raven-Rolfsen keine Teilnahme",0,0,null,"4.","","",0,"",null,"","","",null,"","","",""]
[null,null,null,null,null,null,null,null,null,null,null,null,null,null,"","","",""]
[null,null,"Damen",null,null,null,null,null,null,null,null,null,null,null,"","","",""]
["Soderstorf keine Teilnahme",0,0,null,"1.","","",0,"",null,"Königinenschießen","Name:","Teiler",null,"","","",""]
["Wetzen keine Teilnahme",0,0,null,"2.","","",0,"",null,"","","",null,"","","",""]
{"$rows_left_out":92}
{"sheet":"Orden u. Becher","index":10,"n_rows":0,"n_cols":0,"rows_kept":0,"cut":false,"hidden":false,"merged":[]}

{"sheet":"Satzung","index":11,"n_rows":0,"n_cols":0,"rows_kept":0,"cut":false,"hidden":false,"merged":[]}

{"sheet":"allgemeine Bedingungen","index":12,"n_rows":0,"n_cols":0,"rows_kept":0,"cut":false,"hidden":false,"merged":[]}

{"sheet":"Preisgeldaufteilung","index":13,"n_rows":19,"n_cols":12,"rows_kept":19,"cut":false,"hidden":false,"merged":[[15,5,15,6],[13,7,13,8],[15,7,15,8],[6,5,6,6],[6,7,6,8],[13,5,13,6],[9,5,9,6],[9,7,9,8],[10,5,10,6],[10,7,10,8],[12,5,12,6],[12,7,12,8],[0,0,0,5],[2,5,2,6],[5,5,5,6],[5,7,5,8],[7,5,7,6],[7,7,7,8],[3,7,3,8]]}
["Preisgeldaufteilung"]
[]
[null,null,"Platz","€URO",null,"Preisgeld zur Verteilung"]
[null,null,1,50,null,{"$f":"Preisteilnehmer!G6","v":60},{"$f":"Preisteilnehmer!H6","v":0},"<== Vorschlagswert"]
[null,null,2,40]
[null,null,3,30,null,"Preis pro Satz",null,{"$f":"Preisteilnehmer!H4","v":8}]
[null,null,4,25,null,"Preis für Bestmann",null,20,null,"<== bitte eingeben !"]
[null,null,5,20,null,"Teilnehmer Preisschießen",null,{"$f":"COUNTA(Preisteilnehmer!E8:E107)","v":0}]
[null,null,6,15]
[null,null,7,10,null,"Startkapital Kasse:",null,150,null,"<== bitte eingeben !"]
{"$rows_left_out":9}