{"text_format":"1","workbook":"xlsx","n_sheets":14,"sheets":["Preisteilnehmer","Teilereingabe","Ergebnisse","Ergebnisse Preisschießen","Eyendorf","Raven-Rolfsen","Soderstorf","Wetzen","Sammler","D","Orden u. Becher","Satzung","allgemeine Bedingungen","Preisgeldaufteilung"],"not_rendered":{"charts":0,"images":21,"macros":1,"external_links":0,"defined_names":8,"comments":4,"pivot_tables":0},"unopened":[],"bounds":{"document_bytes":16777216,"sheet_cells":100000,"rows_first":2000,"rows_last":500,"rows_between":2000,"halvings":0,"cell_chars":16384,"cell_head_chars":4096},"cells_cut":0,"cells_raw":0,"read":"whole","date_system":"1900"}

{"sheet":"Preisteilnehmer","index":0,"n_rows":107,"n_cols":8,"rows_kept":107,"cut":false,"hidden":false,"merged":[[0,3,0,4],[2,3,6,3],[2,4,6,4],[2,5,6,5],[4,6,4,7],[1,3,1,5],[6,6,6,7],[3,0,3,2],[4,1,4,2],[5,1,5,2]]}
[null,null,null,"© 2019, Rolf Marquardt, Soderstorf",null,"Version 1.6"]
[null,null,null,"Scheiben Verkauf für Preisschießen"]
[null,null,null,"lfd.\nNummer:","Vor- und Nachname:","Verein:","Einnahmen:","Preis pro Satz:"]
["Vier Vereineschießen in:",null,null,null,null,null,{"$f":"COUNTA(F8:F107)*H4","v":0},8]
["Ort:  ","???",null,null,null,null,"Preisgeld zur Verteilung"]
["Datum:  ","XX.XX.20XX",null,null,null,null,60,{"$f":"G4*G6/100","v":0}]
[]
[null,null,null,1]
[null,null,null,2]
[null,null,null,3]
[null,null,null,4]
[null,null,null,5]
[null,null,null,6]
[null,null,null,7]
[null,null,null,8]
[null,null,null,9]
[null,null,null,10]
[null,null,null,11]
[null,null,null,12]
[null,null,null,13]
[null,null,null,14]
[null,null,null,15]
[null,null,null,16]
[null,null,null,17]
[null,null,null,18]
[null,null,null,19]
[null,null,null,20]
[null,null,null,21]
[null,null,null,22]
[null,null,null,23]
[null,null,null,24]
[null,null,null,25]
[null,null,null,26]
[null,null,null,27]
[null,null,null,28]
[null,null,null,29]
[null,null,null,30]
[null,null,null,31]
[null,null,null,32]
[null,null,null,33]
[null,null,null,34]
[null,null,null,35]
[null,null,null,36]
[null,null,null,37]
[null,null,null,38]
[null,null,null,39]
[null,null,null,40]
[null,null,null,41]
[null,null,null,42]
[null,null,null,43]
[null,null,null,44]
[null,null,null,45]
[null,null,null,46]
[null,null,null,47]
[null,null,null,48]
[null,null,null,49]
[null,null,null,50]
[null,null,null,51]
[null,null,null,52]
[null,null,null,53]
[null,null,null,54]
[null,null,null,55]
[null,null,null,56]
[null,null,null,57]
[null,null,null,58]
[null,null,null,59]
[null,null,null,60]
[null,null,null,61]
[null,null,null,62]
[null,null,null,63]
[null,null,null,64]
[null,null,null,65]
[null,null,null,66]
[null,null,null,67]
[null,null,null,68]
[null,null,null,69]
[null,null,null,70]
[null,null,null,71]
[null,null,null,72]
[null,null,null,73]
[null,null,null,74]
[null,null,null,75]
[null,null,null,76]
[null,null,null,77]
[null,null,null,78]
[null,null,null,79]
[null,null,null,80]
[null,null,null,81]
[null,null,null,82]
[null,null,null,83]
[null,null,null,84]
[null,null,null,85]
[null,null,null,86]
[null,null,null,87]
[null,null,null,88]
[null,null,null,89]
[null,null,null,90]
[null,null,null,91]
[null,null,null,92]
[null,null,null,93]
[null,null,null,94]
[null,null,null,95]
[null,null,null,96]
[null,null,null,97]
[null,null,null,98]
[null,null,null,99]
[null,null,null,100]

{"sheet":"Teilereingabe","index":1,"n_rows":202,"n_cols":7,"rows_kept":202,"cut":false,"hidden":false,"merged":[[1,3,1,6],[0,3,0,6]]}
[]
[null,null,null,"Eingabe Preisteiler:"]
[null,null,"lfd. Nr.","Start\nNummer:","Name:","Verein:","Teiler:"]
[null,null,1,null,{"$f":"IF(D4=\"\",\"\",VLOOKUP(D4,Preisteilnehmer!$D$7:$F$205,2))","v":""},{"$f":"IF(D4=\"\",\"\",VLOOKUP(D4,Preisteilnehmer!$D$7:$F$205,3))","v":""}]
[null,null,2,null,{"$f":"IF(D5=\"\",\"\",VLOOKUP(D5,Preisteilnehmer!$D$7:$F$205,2))","v":""},{"$f":"IF(D5=\"\",\"\",VLOOKUP(D5,Preisteilnehmer!$D$7:$F$205,3))","v":""}]
[null,null,3,null,{"$f":"IF(D6=\"\",\"\",VLOOKUP(D6,Preisteilnehmer!$D$7:$F$205,2))","v":""},{"$f":"IF(D6=\"\",\"\",VLOOKUP(D6,Preisteilnehmer!$D$7:$F$205,3))","v":""}]
[null,null,4,null,{"$f":"IF(D7=\"\",\"\",VLOOKUP(D7,Preisteilnehmer!$D$7:$F$205,2))","v":""},{"$f":"IF(D7=\"\",\"\",VLOOKUP(D7,Preisteilnehmer!$D$7:$F$205,3))","v":""}]
[null,null,5,null,{"$f":"IF(D8=\"\",\"\",VLOOKUP(D8,Preisteilnehmer!$D$7:$F$205,2))","v":""},{"$f":"IF(D8=\"\",\"\",VLOOKUP(D8,Preisteilnehmer!$D$7:$F$205,3))","v":""}]
[null,null,6,null,{"$f":"IF(D9=\"\",\"\",VLOOKUP(D9,Preisteilnehmer!$D$7:$F$205,2))","v":""},{"$f":"IF(D9=\"\",\"\",VLOOKUP(D9,Preisteilnehmer!$D$7:$F$205,3))","v":""}]
[null,null,7,null,{"$f":"IF(D10=\"\",\"\",VLOOKUP(D10,Preisteilnehmer!$D$7:$F$205,2))","v":""},{"$f":"IF(D10=\"\",\"\",VLOOKUP(D10,Preisteilnehmer!$D$7:$F$205,3))","v":""}]
[null,null,8,null,{"$f":"IF(D11=\"\",\"\",VLOOKUP(D11,Preisteilnehmer!$D$7:$F$205,2))","v":""},{"$f":"IF(D11=\"\",\"\",VLOOKUP(D11,Preisteilnehmer!$D$7:$F$205,3))","v":""}]
[null,null,9,null,{"$f":"IF(D12=\"\",\"\",VLOOKUP(D12,Preisteilnehmer!$D$7:$F$205,2))","v":""},{"$f":"IF(D12=\"\",\"\",VLOOKUP(D12,Preisteilnehmer!$D$7:$F$205,3))","v":""}]
[null,null,10,null,{"$f":"IF(D13=\"\",\"\",VLOOKUP(D13,Preisteilnehmer!$D$7:$F$205,2))","v":""},{"$f":"IF(D13=\"\",\"\",VLOOKUP(D13,Preisteilnehmer!$D$7:$F$205,3))","v":""}]
[null,null,11,null,{"$f":"IF(D14=\"\",\"\",VLOOKUP(D14,Preisteilnehmer!$D$7:$F$205,2))","v":""},{"$f":"IF(D14=\"\",\"\",VLOOKUP(D14,Preisteilnehmer!$D$7:$F$205,3))","v":""}]
[null,null,12,null,{"$f":"IF(D15=\"\",\"\",VLOOKUP(D15,Preisteilnehmer!$D$7:$F$205,2))","v":""},{"$f":"IF(D15=\"\",\"\",VLOOKUP(D15,Preisteilnehmer!$D$7:$F$205,3))","v":""}]
[null,null,13,null,{"$f":"IF(D16=\"\",\"\",VLOOKUP(D16,Preisteilnehmer!$D$7:$F$205,2))","v":""},{"$f":"IF(D16=\"\",\"\",VLOOKUP(D16,Preisteilnehmer!$D$7:$F$205,3))","v":""}]
[null,null,14,null,{"$f":"IF(D17=\"\",\"\",VLOOKUP(D17,Preisteilnehmer!$D$7:$F$205,2))","v":""},{"$f":"IF(D17=\"\",\"\",VLOOKUP(D17,Preisteilnehmer!$D$7:$F$205,3))","v":""}]
[null,null,15,null,{"$f":"IF(D18=\"\",\"\",VLOOKUP(D18,Preisteilnehmer!$D$7:$F$205,2))","v":""},{"$f":"IF(D18=\"\",\"\",VLOOKUP(D18,Preisteilnehmer!$D$7:$F$205,3))","v":""}]
[null,null,16,null,{"$f":"IF(D19=\"\",\"\",VLOOKUP(D19,Preisteilnehmer!$D$7:$F$205,2))","v":""},{"$f":"IF(D19=\"\",\"\",VLOOKUP(D19,Preisteilnehmer!$D$7:$F$205,3))","v":""}]
[null,null,17,null,{"$f":"IF(D20=\"\",\"\",VLOOKUP(D20,Preisteilnehmer!$D$7:$F$205,2))","v":""},{"$f":"IF(D20=\"\",\"\",VLOOKUP(D20,Preisteilnehmer!$D$7:$F$205,3))","v":""}]
[null,null,18,null,{"$f":"IF(D21=\"\",\"\",VLOOKUP(D21,Preisteilnehmer!$D$7:$F$205,2))","v":""},{"$f":"IF(D21=\"\",\"\",VLOOKUP(D21,Preisteilnehmer!$D$7:$F$205,3))","v":""}]
[null,null,19,null,{"$f":"IF(D22=\"\",\"\",VLOOKUP(D22,Preisteilnehmer!$D$7:$F$205,2))","v":""},{"$f":"IF(D22=\"\",\"\",VLOOKUP(D22,Preisteilnehmer!$D$7:$F$205,3))","v":""}]
[null,null,20,null,{"$f":"IF(D23=\"\",\"\",VLOOKUP(D23,Preisteilnehmer!$D$7:$F$205,2))","v":""},{"$f":"IF(D23=\"\",\"\",VLOOKUP(D23,Preisteilnehmer!$D$7:$F$205,3))","v":""}]
[null,null,21,null,{"$f":"IF(D24=\"\",\"\",VLOOKUP(D24,Preisteilnehmer!$D$7:$F$205,2))","v":""},{"$f":"IF(D24=\"\",\"\",VLOOKUP(D24,Preisteilnehmer!$D$7:$F$205,3))","v":""}]
[null,null,22,null,{"$f":"IF(D25=\"\",\"\",VLOOKUP(D25,Preisteilnehmer!$D$7:$F$205,2))","v":""},{"$f":"IF(D25=\"\",\"\",VLOOKUP(D25,Preisteilnehmer!$D$7:$F$205,3))","v":""}]
[null,null,23,null,{"$f":"IF(D26=\"\",\"\",VLOOKUP(D26,Preisteilnehmer!$D$7:$F$205,2))","v":""},{"$f":"IF(D26=\"\",\"\",VLOOKUP(D26,Preisteilnehmer!$D$7:$F$205,3))","v":""}]
[null,null,24,null,{"$f":"IF(D27=\"\",\"\",VLOOKUP(D27,Preisteilnehmer!$D$7:$F$205,2))","v":""},{"$f":"IF(D27=\"\",\"\",VLOOKUP(D27,Preisteilnehmer!$D$7:$F$205,3))","v":""}]
[null,null,25,null,{"$f":"IF(D28=\"\",\"\",VLOOKUP(D28,Preisteilnehmer!$D$7:$F$205,2))","v":""},{"$f":"IF(D28=\"\",\"\",VLOOKUP(D28,Preisteilnehmer!$D$7:$F$205,3))","v":""}]
[null,null,26,null,{"$f":"IF(D29=\"\",\"\",VLOOKUP(D29,Preisteilnehmer!$D$7:$F$205,2))","v":""},{"$f":"IF(D29=\"\",\"\",VLOOKUP(D29,Preisteilnehmer!$D$7:$F$205,3))","v":""}]
[null,null,27,null,{"$f":"IF(D30=\"\",\"\",VLOOKUP(D30,Preisteilnehmer!$D$7:$F$205,2))","v":""},{"$f":"IF(D30=\"\",\"\",VLOOKUP(D30,Preisteilnehmer!$D$7:$F$205,3))","v":""}]
[null,null,28,null,{"$f":"IF(D31=\"\",\"\",VLOOKUP(D31,Preisteilnehmer!$D$7:$F$205,2))","v":""},{"$f":"IF(D31=\"\",\"\",VLOOKUP(D31,Preisteilnehmer!$D$7:$F$205,3))","v":""}]
[null,null,29,null,{"$f":"IF(D32=\"\",\"\",VLOOKUP(D32,Preisteilnehmer!$D$7:$F$205,2))","v":""},{"$f":"IF(D32=\"\",\"\",VLOOKUP(D32,Preisteilnehmer!$D$7:$F$205,3))","v":""}]
[null,null,30,null,{"$f":"IF(D33=\"\",\"\",VLOOKUP(D33,Preisteilnehmer!$D$7:$F$205,2))","v":""},{"$f":"IF(D33=\"\",\"\",VLOOKUP(D33,Preisteilnehmer!$D$7:$F$205,3))","v":""}]
[null,null,31,null,{"$f":"IF(D34=\"\",\"\",VLOOKUP(D34,Preisteilnehmer!$D$7:$F$205,2))","v":""},{"$f":"IF(D34=\"\",\"\",VLOOKUP(D34,Preisteilnehmer!$D$7:$F$205,3))","v":""}]
[null,null,32,null,{"$f":"IF(D35=\"\",\"\",VLOOKUP(D35,Preisteilnehmer!$D$7:$F$205,2))","v":""},{"$f":"IF(D35=\"\",\"\",VLOOKUP(D35,Preisteilnehmer!$D$7:$F$205,3))","v":""}]
[null,null,33,null,{"$f":"IF(D36=\"\",\"\",VLOOKUP(D36,Preisteilnehmer!$D$7:$F$205,2))","v":""},{"$f":"IF(D36=\"\",\"\",VLOOKUP(D36,Preisteilnehmer!$D$7:$F$205,3))","v":""}]
[null,null,34,null,{"$f":"IF(D37=\"\",\"\",VLOOKUP(D37,Preisteilnehmer!$D$7:$F$205,2))","v":""},{"$f":"IF(D37=\"\",\"\",VLOOKUP(D37,Preisteilnehmer!$D$7:$F$205,3))","v":""}]
[null,null,35,null,{"$f":"IF(D38=\"\",\"\",VLOOKUP(D38,Preisteilnehmer!$D$7:$F$205,2))","v":""},{"$f":"IF(D38=\"\",\"\",VLOOKUP(D38,Preisteilnehmer!$D$7:$F$205,3))","v":""}]
[null,null,36,null,{"$f":"IF(D39=\"\",\"\",VLOOKUP(D39,Preisteilnehmer!$D$7:$F$205,2))","v":""},{"$f":"IF(D39=\"\",\"\",VLOOKUP(D39,Preisteilnehmer!$D$7:$F$205,3))","v":""}]
[null,null,37,null,{"$f":"IF(D40=\"\",\"\",VLOOKUP(D40,Preisteilnehmer!$D$7:$F$205,2))","v":""},{"$f":"IF(D40=\"\",\"\",VLOOKUP(D40,Preisteilnehmer!$D$7:$F$205,3))","v":""}]
[null,null,38,null,{"$f":"IF(D41=\"\",\"\",VLOOKUP(D41,Preisteilnehmer!$D$7:$F$205,2))","v":""},{"$f":"IF(D41=\"\",\"\",VLOOKUP(D41,Preisteilnehmer!$D$7:$F$205,3))","v":""}]
[null,null,39,null,{"$f":"IF(D42=\"\",\"\",VLOOKUP(D42,Preisteilnehmer!$D$7:$F$205,2))","v":""},{"$f":"IF(D42=\"\",\"\",VLOOKUP(D42,Preisteilnehmer!$D$7:$F$205,3))","v":""}]
[null,null,40,null,{"$f":"IF(D43=\"\",\"\",VLOOKUP(D43,Preisteilnehmer!$D$7:$F$205,2))","v":""},{"$f":"IF(D43=\"\",\"\",VLOOKUP(D43,Preisteilnehmer!$D$7:$F$205,3))","v":""}]
[null,null,41,null,{"$f":"IF(D44=\"\",\"\",VLOOKUP(D44,Preisteilnehmer!$D$7:$F$205,2))","v":""},{"$f":"IF(D44=\"\",\"\",VLOOKUP(D44,Preisteilnehmer!$D$7:$F$205,3))","v":""}]
[null,null,42,null,{"$f":"IF(D45=\"\",\"\",VLOOKUP(D45,Preisteilnehmer!$D$7:$F$205,2))","v":""},{"$f":"IF(D45=\"\",\"\",VLOOKUP(D45,Preisteilnehmer!$D$7:$F$205,3))","v":""}]
[null,null,43,null,{"$f":"IF(D46=\"\",\"\",VLOOKUP(D46,Preisteilnehmer!$D$7:$F$205,2))","v":""},{"$f":"IF(D46=\"\",\"\",VLOOKUP(D46,Preisteilnehmer!$D$7:$F$205,3))","v":""}]
[null,null,44,null,{"$f":"IF(D47=\"\",\"\",VLOOKUP(D47,Preisteilnehmer!$D$7:$F$205,2))","v":""},{"$f":"IF(D47=\"\",\"\",VLOOKUP(D47,Preisteilnehmer!$D$7:$F$205,3))","v":""}]
[null,null,45,null,{"$f":"IF(D48=\"\",\"\",VLOOKUP(D48,Preisteilnehmer!$D$7:$F$205,2))","v":""},{"$f":"IF(D48=\"\",\"\",VLOOKUP(D48,Preisteilnehmer!$D$7:$F$205,3))","v":""}]
[null,null,46,null,{"$f":"IF(D49=\"\",\"\",VLOOKUP(D49,Preisteilnehmer!$D$7:$F$205,2))","v":""},{"$f":"IF(D49=\"\",\"\",VLOOKUP(D49,Preisteilnehmer!$D$7:$F$205,3))","v":""}]
[null,null,47,null,{"$f":"IF(D50=\"\",\"\",VLOOKUP(D50,Preisteilnehmer!$D$7:$F$205,2))","v":""},{"$f":"IF(D50=\"\",\"\",VLOOKUP(D50,Preisteilnehmer!$D$7:$F$205,3))","v":""}]
[null,null,48,null,{"$f":"IF(D51=\"\",\"\",VLOOKUP(D51,Preisteilnehmer!$D$7:$F$205,2))","v":""},{"$f":"IF(D51=\"\",\"\",VLOOKUP(D51,Preisteilnehmer!$D$7:$F$205,3))","v":""}]
[null,null,49,null,{"$f":"IF(D52=\"\",\"\",VLOOKUP(D52,Preisteilnehmer!$D$7:$F$205,2))","v":""},{"$f":"IF(D52=\"\",\"\",VLOOKUP(D52,Preisteilnehmer!$D$7:$F$205,3))","v":""}]
[null,null,50,null,{"$f":"IF(D53=\"\",\"\",VLOOKUP(D53,Preisteilnehmer!$D$7:$F$205,2))","v":""},{"$f":"IF(D53=\"\",\"\",VLOOKUP(D53,Preisteilnehmer!$D$7:$F$205,3))","v":""}]
[null,null,51,null,{"$f":"IF(D54=\"\",\"\",VLOOKUP(D54,Preisteilnehmer!$D$7:$F$205,2))","v":""},{"$f":"IF(D54=\"\",\"\",VLOOKUP(D54,Preisteilnehmer!$D$7:$F$205,3))","v":""}]
[null,null,52,null,{"$f":"IF(D55=\"\",\"\",VLOOKUP(D55,Preisteilnehmer!$D$7:$F$205,2))","v":""},{"$f":"IF(D55=\"\",\"\",VLOOKUP(D55,Preisteilnehmer!$D$7:$F$205,3))","v":""}]
[null,null,53,null,{"$f":"IF(D56=\"\",\"\",VLOOKUP(D56,Preisteilnehmer!$D$7:$F$205,2))","v":""},{"$f":"IF(D56=\"\",\"\",VLOOKUP(D56,Preisteilnehmer!$D$7:$F$205,3))","v":""}]
[null,null,54,null,{"$f":"IF(D57=\"\",\"\",VLOOKUP(D57,Preisteilnehmer!$D$7:$F$205,2))","v":""},{"$f":"IF(D57=\"\",\"\",VLOOKUP(D57,Preisteilnehmer!$D$7:$F$205,3))","v":""}]
[null,null,55,null,{"$f":"IF(D58=\"\",\"\",VLOOKUP(D58,Preisteilnehmer!$D$7:$F$205,2))","v":""},{"$f":"IF(D58=\"\",\"\",VLOOKUP(D58,Preisteilnehmer!$D$7:$F$205,3))","v":""}]
[null,null,56,null,{"$f":"IF(D59=\"\",\"\",VLOOKUP(D59,Preisteilnehmer!$D$7:$F$205,2))","v":""},{"$f":"IF(D59=\"\",\"\",VLOOKUP(D59,Preisteilnehmer!$D$7:$F$205,3))","v":""}]
[null,null,57,null,{"$f":"IF(D60=\"\",\"\",VLOOKUP(D60,Preisteilnehmer!$D$7:$F$205,2))","v":""},{"$f":"IF(D60=\"\",\"\",VLOOKUP(D60,Preisteilnehmer!$D$7:$F$205,3))","v":""}]
[null,null,58,null,{"$f":"IF(D61=\"\",\"\",VLOOKUP(D61,Preisteilnehmer!$D$7:$F$205,2))","v":""},{"$f":"IF(D61=\"\",\"\",VLOOKUP(D61,Preisteilnehmer!$D$7:$F$205,3))","v":""}]
[null,null,59,null,{"$f":"IF(D62=\"\",\"\",VLOOKUP(D62,Preisteilnehmer!$D$7:$F$205,2))","v":""},{"$f":"IF(D62=\"\",\"\",VLOOKUP(D62,Preisteilnehmer!$D$7:$F$205,3))","v":""}]
[null,null,60,null,{"$f":"IF(D63=\"\",\"\",VLOOKUP(D63,Preisteilnehmer!$D$7:$F$205,2))","v":""},{"$f":"IF(D63=\"\",\"\",VLOOKUP(D63,Preisteilnehmer!$D$7:$F$205,3))","v":""}]
[null,null,61,null,{"$f":"IF(D64=\"\",\"\",VLOOKUP(D64,Preisteilnehmer!$D$7:$F$205,2))","v":""},{"$f":"IF(D64=\"\",\"\",VLOOKUP(D64,Preisteilnehmer!$D$7:$F$205,3))","v":""}]
[null,null,62,null,{"$f":"IF(D65=\"\",\"\",VLOOKUP(D65,Preisteilnehmer!$D$7:$F$205,2))","v":""},{"$f":"IF(D65=\"\",\"\",VLOOKUP(D65,Preisteilnehmer!$D$7:$F$205,3))","v":""}]
[null,null,63,null,{"$f":"IF(D66=\"\",\"\",VLOOKUP(D66,Preisteilnehmer!$D$7:$F$205,2))","v":""},{"$f":"IF(D66=\"\",\"\",VLOOKUP(D66,Preisteilnehmer!$D$7:$F$205,3))","v":""}]
[null,null,64,null,{"$f":"IF(D67=\"\",\"\",VLOOKUP(D67,Preisteilnehmer!$D$7:$F$205,2))","v":""},{"$f":"IF(D67=\"\",\"\",VLOOKUP(D67,Preisteilnehmer!$D$7:$F$205,3))","v":""}]
[null,null,65,null,{"$f":"IF(D68=\"\",\"\",VLOOKUP(D68,Preisteilnehmer!$D$7:$F$205,2))","v":""},{"$f":"IF(D68=\"\",\"\",VLOOKUP(D68,Preisteilnehmer!$D$7:$F$205,3))","v":""}]
[null,null,66,null,{"$f":"IF(D69=\"\",\"\",VLOOKUP(D69,Preisteilnehmer!$D$7:$F$205,2))","v":""},{"$f":"IF(D69=\"\",\"\",VLOOKUP(D69,Preisteilnehmer!$D$7:$F$205,3))","v":""}]
[null,null,67,null,{"$f":"IF(D70=\"\",\"\",VLOOKUP(D70,Preisteilnehmer!$D$7:$F$205,2))","v":""},{"$f":"IF(D70=\"\",\"\",VLOOKUP(D70,Preisteilnehmer!$D$7:$F$205,3))","v":""}]
[null,null,68,null,{"$f":"IF(D71=\"\",\"\",VLOOKUP(D71,Preisteilnehmer!$D$7:$F$205,2))","v":""},{"$f":"IF(D71=\"\",\"\",VLOOKUP(D71,Preisteilnehmer!$D$7:$F$205,3))","v":""}]
[null,null,69,null,{"$f":"IF(D72=\"\",\"\",VLOOKUP(D72,Preisteilnehmer!$D$7:$F$205,2))","v":""},{"$f":"IF(D72=\"\",\"\",VLOOKUP(D72,Preisteilnehmer!$D$7:$F$205,3))","v":""}]
[null,null,70,null,{"$f":"IF(D73=\"\",\"\",VLOOKUP(D73,Preisteilnehmer!$D$7:$F$205,2))","v":""},{"$f":"IF(D73=\"\",\"\",VLOOKUP(D73,Preisteilnehmer!$D$7:$F$205,3))","v":""}]
[null,null,71,null,{"$f":"IF(D74=\"\",\"\",VLOOKUP(D74,Preisteilnehmer!$D$7:$F$205,2))","v":""},{"$f":"IF(D74=\"\",\"\",VLOOKUP(D74,Preisteilnehmer!$D$7:$F$205,3))","v":""}]
[null,null,72,null,{"$f":"IF(D75=\"\",\"\",VLOOKUP(D75,Preisteilnehmer!$D$7:$F$205,2))","v":""},{"$f":"IF(D75=\"\",\"\",VLOOKUP(D75,Preisteilnehmer!$D$7:$F$205,3))","v":""}]
[null,null,73,null,{"$f":"IF(D76=\"\",\"\",VLOOKUP(D76,Preisteilnehmer!$D$7:$F$205,2))","v":""},{"$f":"IF(D76=\"\",\"\",VLOOKUP(D76,Preisteilnehmer!$D$7:$F$205,3))","v":""}]
[null,null,74,null,{"$f":"IF(D77=\"\",\"\",VLOOKUP(D77,Preisteilnehmer!$D$7:$F$205,2))","v":""},{"$f":"IF(D77=\"\",\"\",VLOOKUP(D77,Preisteilnehmer!$D$7:$F$205,3))","v":""}]
[null,null,75,null,{"$f":"IF(D78=\"\",\"\",VLOOKUP(D78,Preisteilnehmer!$D$7:$F$205,2))","v":""},{"$f":"IF(D78=\"\",\"\",VLOOKUP(D78,Preisteilnehmer!$D$7:$F$205,3))","v":""}]
[null,null,76,null,{"$f":"IF(D79=\"\",\"\",VLOOKUP(D79,Preisteilnehmer!$D$7:$F$205,2))","v":""},{"$f":"IF(D79=\"\",\"\",VLOOKUP(D79,Preisteilnehmer!$D$7:$F$205,3))","v":""}]
[null,null,77,null,{"$f":"IF(D80=\"\",\"\",VLOOKUP(D80,Preisteilnehmer!$D$7:$F$205,2))","v":""},{"$f":"IF(D80=\"\",\"\",VLOOKUP(D80,Preisteilnehmer!$D$7:$F$205,3))","v":""}]
[null,null,78,null,{"$f":"IF(D81=\"\",\"\",VLOOKUP(D81,Preisteilnehmer!$D$7:$F$205,2))","v":""},{"$f":"IF(D81=\"\",\"\",VLOOKUP(D81,Preisteilnehmer!$D$7:$F$205,3))","v":""}]
[null,null,79,null,{"$f":"IF(D82=\"\",\"\",VLOOKUP(D82,Preisteilnehmer!$D$7:$F$205,2))","v":""},{"$f":"IF(D82=\"\",\"\",VLOOKUP(D82,Preisteilnehmer!$D$7:$F$205,3))","v":""}]
[null,null,80,null,{"$f":"IF(D83=\"\",\"\",VLOOKUP(D83,Preisteilnehmer!$D$7:$F$205,2))","v":""},{"$f":"IF(D83=\"\",\"\",VLOOKUP(D83,Preisteilnehmer!$D$7:$F$205,3))","v":""}]
[null,null,81,null,{"$f":"IF(D84=\"\",\"\",VLOOKUP(D84,Preisteilnehmer!$D$7:$F$205,2))","v":""},{"$f":"IF(D84=\"\",\"\",VLOOKUP(D84,Preisteilnehmer!$D$7:$F$205,3))","v":""}]
[null,null,82,null,{"$f":"IF(D85=\"\",\"\",VLOOKUP(D85,Preisteilnehmer!$D$7:$F$205,2))","v":""},{"$f":"IF(D85=\"\",\"\",VLOOKUP(D85,Preisteilnehmer!$D$7:$F$205,3))","v":""}]
[null,null,83,null,{"$f":"IF(D86=\"\",\"\",VLOOKUP(D86,Preisteilnehmer!$D$7:$F$205,2))","v":""},{"$f":"IF(D86=\"\",\"\",VLOOKUP(D86,Preisteilnehmer!$D$7:$F$205,3))","v":""}]
[null,null,84,null,{"$f":"IF(D87=\"\",\"\",VLOOKUP(D87,Preisteilnehmer!$D$7:$F$205,2))","v":""},{"$f":"IF(D87=\"\",\"\",VLOOKUP(D87,Preisteilnehmer!$D$7:$F$205,3))","v":""}]
[null,null,85,null,{"$f":"IF(D88=\"\",\"\",VLOOKUP(D88,Preisteilnehmer!$D$7:$F$205,2))","v":""},{"$f":"IF(D88=\"\",\"\",VLOOKUP(D88,Preisteilnehmer!$D$7:$F$205,3))","v":""}]
[null,null,86,null,{"$f":"IF(D89=\"\",\"\",VLOOKUP(D89,Preisteilnehmer!$D$7:$F$205,2))","v":""},{"$f":"IF(D89=\"\",\"\",VLOOKUP(D89,Preisteilnehmer!$D$7:$F$205,3))","v":""}]
[null,null,87,null,{"$f":"IF(D90=\"\",\"\",VLOOKUP(D90,Preisteilnehmer!$D$7:$F$205,2))","v":""},{"$f":"IF(D90=\"\",\"\",VLOOKUP(D90,Preisteilnehmer!$D$7:$F$205,3))","v":""}]
[null,null,88,null,{"$f":"IF(D91=\"\",\"\",VLOOKUP(D91,Preisteilnehmer!$D$7:$F$205,2))","v":""},{"$f":"IF(D91=\"\",\"\",VLOOKUP(D91,Preisteilnehmer!$D$7:$F$205,3))","v":""}]
[null,null,89,null,{"$f":"IF(D92=\"\",\"\",VLOOKUP(D92,Preisteilnehmer!$D$7:$F$205,2))","v":""},{"$f":"IF(D92=\"\",\"\",VLOOKUP(D92,Preisteilnehmer!$D$7:$F$205,3))","v":""}]
[null,null,90,null,{"$f":"IF(D93=\"\",\"\",VLOOKUP(D93,Preisteilnehmer!$D$7:$F$205,2))","v":""},{"$f":"IF(D93=\"\",\"\",VLOOKUP(D93,Preisteilnehmer!$D$7:$F$205,3))","v":""}]
[null,null,91,null,{"$f":"IF(D94=\"\",\"\",VLOOKUP(D94,Preisteilnehmer!$D$7:$F$205,2))","v":""},{"$f":"IF(D94=\"\",\"\",VLOOKUP(D94,Preisteilnehmer!$D$7:$F$205,3))","v":""}]
[null,null,92,null,{"$f":"IF(D95=\"\",\"\",VLOOKUP(D95,Preisteilnehmer!$D$7:$F$205,2))","v":""},{"$f":"IF(D95=\"\",\"\",VLOOKUP(D95,Preisteilnehmer!$D$7:$F$205,3))","v":""}]
[null,null,93,null,{"$f":"IF(D96=\"\",\"\",VLOOKUP(D96,Preisteilnehmer!$D$7:$F$205,2))","v":""},{"$f":"IF(D96=\"\",\"\",VLOOKUP(D96,Preisteilnehmer!$D$7:$F$205,3))","v":""}]
[null,null,94,null,{"$f":"IF(D97=\"\",\"\",VLOOKUP(D97,Preisteilnehmer!$D$7:$F$205,2))","v":""},{"$f":"IF(D97=\"\",\"\",VLOOKUP(D97,Preisteilnehmer!$D$7:$F$205,3))","v":""}]
[null,null,95,null,{"$f":"IF(D98=\"\",\"\",VLOOKUP(D98,Preisteilnehmer!$D$7:$F$205,2))","v":""},{"$f":"IF(D98=\"\",\"\",VLOOKUP(D98,Preisteilnehmer!$D$7:$F$205,3))","v":""}]
[null,null,96,null,{"$f":"IF(D99=\"\",\"\",VLOOKUP(D99,Preisteilnehmer!$D$7:$F$205,2))","v":""},{"$f":"IF(D99=\"\",\"\",VLOOKUP(D99,Preisteilnehmer!$D$7:$F$205,3))","v":""}]
[null,null,97,null,{"$f":"IF(D100=\"\",\"\",VLOOKUP(D100,Preisteilnehmer!$D$7:$F$205,2))","v":""},{"$f":"IF(D100=\"\",\"\",VLOOKUP(D100,Preisteilnehmer!$D$7:$F$205,3))","v":""}]
[null,null,98,null,{"$f":"IF(D101=\"\",\"\",VLOOKUP(D101,Preisteilnehmer!$D$7:$F$205,2))","v":""},{"$f":"IF(D101=\"\",\"\",VLOOKUP(D101,Preisteilnehmer!$D$7:$F$205,3))","v":""}]
[null,null,99,null,{"$f":"IF(D102=\"\",\"\",VLOOKUP(D102,Preisteilnehmer!$D$7:$F$205,2))","v":""},{"$f":"IF(D102=\"\",\"\",VLOOKUP(D102,Preisteilnehmer!$D$7:$F$205,3))","v":""}]
[null,null,null,null,{"$f":"IF(D103=\"\",\"\",VLOOKUP(D103,Preisteilnehmer!$D$7:$F$205,2))","v":""},{"$f":"IF(D103=\"\",\"\",VLOOKUP(D103,Preisteilnehmer!$D$7:$F$205,3))","v":""}]
[null,null,null,null,{"$f":"IF(D104=\"\",\"\",VLOOKUP(D104,Preisteilnehmer!$D$7:$F$205,2))","v":""},{"$f":"IF(D104=\"\",\"\",VLOOKUP(D104,Preisteilnehmer!$D$7:$F$205,3))","v":""}]
[null,null,null,null,{"$f":"IF(D105=\"\",\"\",VLOOKUP(D105,Preisteilnehmer!$D$7:$F$205,2))","v":""},{"$f":"IF(D105=\"\",\"\",VLOOKUP(D105,Preisteilnehmer!$D$7:$F$205,3))","v":""}]
[null,null,null,null,{"$f":"IF(D106=\"\",\"\",VLOOKUP(D106,Preisteilnehmer!$D$7:$F$205,2))","v":""},{"$f":"IF(D106=\"\",\"\",VLOOKUP(D106,Preisteilnehmer!$D$7:$F$205,3))","v":""}]
[null,null,null,null,{"$f":"IF(D107=\"\",\"\",VLOOKUP(D107,Preisteilnehmer!$D$7:$F$205,2))","v":""},{"$f":"IF(D107=\"\",\"\",VLOOKUP(D107,Preisteilnehmer!$D$7:$F$205,3))","v":""}]
[null,null,null,null,{"$f":"IF(D108=\"\",\"\",VLOOKUP(D108,Preisteilnehmer!$D$7:$F$205,2))","v":""},{"$f":"IF(D108=\"\",\"\",VLOOKUP(D108,Preisteilnehmer!$D$7:$F$205,3))","v":""}]
[null,null,null,null,{"$f":"IF(D109=\"\",\"\",VLOOKUP(D109,Preisteilnehmer!$D$7:$F$205,2))","v":""},{"$f":"IF(D109=\"\",\"\",VLOOKUP(D109,Preisteilnehmer!$D$7:$F$205,3))","v":""}]
[null,null,null,null,{"$f":"IF(D110=\"\",\"\",VLOOKUP(D110,Preisteilnehmer!$D$7:$F$205,2))","v":""},{"$f":"IF(D110=\"\",\"\",VLOOKUP(D110,Preisteilnehmer!$D$7:$F$205,3))","v":""}]
[null,null,null,null,{"$f":"IF(D111=\"\",\"\",VLOOKUP(D111,Preisteilnehmer!$D$7:$F$205,2))","v":""},{"$f":"IF(D111=\"\",\"\",VLOOKUP(D111,Preisteilnehmer!$D$7:$F$205,3))","v":""}]
[null,null,null,null,{"$f":"IF(D112=\"\",\"\",VLOOKUP(D112,Preisteilnehmer!$D$7:$F$205,2))","v":""},{"$f":"IF(D112=\"\",\"\",VLOOKUP(D112,Preisteilnehmer!$D$7:$F$205,3))","v":""}]
[null,null,null,null,{"$f":"IF(D113=\"\",\"\",VLOOKUP(D113,Preisteilnehmer!$D$7:$F$205,2))","v":""},{"$f":"IF(D113=\"\",\"\",VLOOKUP(D113,Preisteilnehmer!$D$7:$F$205,3))","v":""}]
[null,null,null,null,{"$f":"IF(D114=\"\",\"\",VLOOKUP(D114,Preisteilnehmer!$D$7:$F$205,2))","v":""},{"$f":"IF(D114=\"\",\"\",VLOOKUP(D114,Preisteilnehmer!$D$7:$F$205,3))","v":""}]
[null,null,null,null,{"$f":"IF(D115=\"\",\"\",VLOOKUP(D115,Preisteilnehmer!$D$7:$F$205,2))","v":""},{"$f":"IF(D115=\"\",\"\",VLOOKUP(D115,Preisteilnehmer!$D$7:$F$205,3))","v":""}]
[null,null,null,null,{"$f":"IF(D116=\"\",\"\",VLOOKUP(D116,Preisteilnehmer!$D$7:$F$205,2))","v":""},{"$f":"IF(D116=\"\",\"\",VLOOKUP(D116,Preisteilnehmer!$D$7:$F$205,3))","v":""}]
[null,null,null,null,{"$f":"IF(D117=\"\",\"\",VLOOKUP(D117,Preisteilnehmer!$D$7:$F$205,2))","v":""},{"$f":"IF(D117=\"\",\"\",VLOOKUP(D117,Preisteilnehmer!$D$7:$F$205,3))","v":""}]
[null,null,null,null,{"$f":"IF(D118=\"\",\"\",VLOOKUP(D118,Preisteilnehmer!$D$7:$F$205,2))","v":""},{"$f":"IF(D118=\"\",\"\",VLOOKUP(D118,Preisteilnehmer!$D$7:$F$205,3))","v":""}]
[null,null,null,null,{"$f":"IF(D119=\"\",\"\",VLOOKUP(D119,Preisteilnehmer!$D$7:$F$205,2))","v":""},{"$f":"IF(D119=\"\",\"\",VLOOKUP(D119,Preisteilnehmer!$D$7:$F$205,3))","v":""}]
[null,null,null,null,{"$f":"IF(D120=\"\",\"\",VLOOKUP(D120,Preisteilnehmer!$D$7:$F$205,2))","v":""},{"$f":"IF(D120=\"\",\"\",VLOOKUP(D120,Preisteilnehmer!$D$7:$F$205,3))","v":""}]
[null,null,null,null,{"$f":"IF(D121=\"\",\"\",VLOOKUP(D121,Preisteilnehmer!$D$7:$F$205,2))","v":""},{"$f":"IF(D121=\"\",\"\",VLOOKUP(D121,Preisteilnehmer!$D$7:$F$205,3))","v":""}]
[null,null,null,null,{"$f":"IF(D122=\"\",\"\",VLOOKUP(D122,Preisteilnehmer!$D$7:$F$205,2))","v":""},{"$f":"IF(D122=\"\",\"\",VLOOKUP(D122,Preisteilnehmer!$D$7:$F$205,3))","v":""}]
[null,null,null,null,{"$f":"IF(D123=\"\",\"\",VLOOKUP(D123,Preisteilnehmer!$D$7:$F$205,2))","v":""},{"$f":"IF(D123=\"\",\"\",VLOOKUP(D123,Preisteilnehmer!$D$7:$F$205,3))","v":""}]
[null,null,null,null,{"$f":"IF(D124=\"\",\"\",VLOOKUP(D124,Preisteilnehmer!$D$7:$F$205,2))","v":""},{"$f":"IF(D124=\"\",\"\",VLOOKUP(D124,Preisteilnehmer!$D$7:$F$205,3))","v":""}]
[null,null,null,null,{"$f":"IF(D125=\"\",\"\",VLOOKUP(D125,Preisteilnehmer!$D$7:$F$205,2))","v":""},{"$f":"IF(D125=\"\",\"\",VLOOKUP(D125,Preisteilnehmer!$D$7:$F$205,3))","v":""}]
[null,null,null,null,{"$f":"IF(D126=\"\",\"\",VLOOKUP(D126,Preisteilnehmer!$D$7:$F$205,2))","v":""},{"$f":"IF(D126=\"\",\"\",VLOOKUP(D126,Preisteilnehmer!$D$7:$F$205,3))","v":""}]
[null,null,null,null,{"$f":"IF(D127=\"\",\"\",VLOOKUP(D127,Preisteilnehmer!$D$7:$F$205,2))","v":""},{"$f":"IF(D127=\"\",\"\",VLOOKUP(D127,Preisteilnehmer!$D$7:$F$205,3))","v":""}]
[null,null,null,null,{"$f":"IF(D128=\"\",\"\",VLOOKUP(D128,Preisteilnehmer!$D$7:$F$205,2))","v":""},{"$f":"IF(D128=\"\",\"\",VLOOKUP(D128,Preisteilnehmer!$D$7:$F$205,3))","v":""}]
[null,null,null,null,{"$f":"IF(D129=\"\",\"\",VLOOKUP(D129,Preisteilnehmer!$D$7:$F$205,2))","v":""},{"$f":"IF(D129=\"\",\"\",VLOOKUP(D129,Preisteilnehmer!$D$7:$F$205,3))","v":""}]
[null,null,null,null,{"$f":"IF(D130=\"\",\"\",VLOOKUP(D130,Preisteilnehmer!$D$7:$F$205,2))","v":""},{"$f":"IF(D130=\"\",\"\",VLOOKUP(D130,Preisteilnehmer!$D$7:$F$205,3))","v":""}]
[null,null,null,null,{"$f":"IF(D131=\"\",\"\",VLOOKUP(D131,Preisteilnehmer!$D$7:$F$205,2))","v":""},{"$f":"IF(D131=\"\",\"\",VLOOKUP(D131,Preisteilnehmer!$D$7:$F$205,3))","v":""}]
[null,null,null,null,{"$f":"IF(D132=\"\",\"\",VLOOKUP(D132,Preisteilnehmer!$D$7:$F$205,2))","v":""},{"$f":"IF(D132=\"\",\"\",VLOOKUP(D132,Preisteilnehmer!$D$7:$F$205,3))","v":""}]
[null,null,null,null,{"$f":"IF(D133=\"\",\"\",VLOOKUP(D133,Preisteilnehmer!$D$7:$F$205,2))","v":""},{"$f":"IF(D133=\"\",\"\",VLOOKUP(D133,Preisteilnehmer!$D$7:$F$205,3))","v":""}]
[null,null,null,null,{"$f":"IF(D134=\"\",\"\",VLOOKUP(D134,Preisteilnehmer!$D$7:$F$205,2))","v":""},{"$f":"IF(D134=\"\",\"\",VLOOKUP(D134,Preisteilnehmer!$D$7:$F$205,3))","v":""}]
[null,null,null,null,{"$f":"IF(D135=\"\",\"\",VLOOKUP(D135,Preisteilnehmer!$D$7:$F$205,2))","v":""},{"$f":"IF(D135=\"\",\"\",VLOOKUP(D135,Preisteilnehmer!$D$7:$F$205,3))","v":""}]
[null,null,null,null,{"$f":"IF(D136=\"\",\"\",VLOOKUP(D136,Preisteilnehmer!$D$7:$F$205,2))","v":""},{"$f":"IF(D136=\"\",\"\",VLOOKUP(D136,Preisteilnehmer!$D$7:$F$205,3))","v":""}]
[null,null,null,null,{"$f":"IF(D137=\"\",\"\",VLOOKUP(D137,Preisteilnehmer!$D$7:$F$205,2))","v":""},{"$f":"IF(D137=\"\",\"\",VLOOKUP(D137,Preisteilnehmer!$D$7:$F$205,3))","v":""}]
[null,null,null,null,{"$f":"IF(D138=\"\",\"\",VLOOKUP(D138,Preisteilnehmer!$D$7:$F$205,2))","v":""},{"$f":"IF(D138=\"\",\"\",VLOOKUP(D138,Preisteilnehmer!$D$7:$F$205,3))","v":""}]
[null,null,null,null,{"$f":"IF(D139=\"\",\"\",VLOOKUP(D139,Preisteilnehmer!$D$7:$F$205,2))","v":""},{"$f":"IF(D139=\"\",\"\",VLOOKUP(D139,Preisteilnehmer!$D$7:$F$205,3))","v":""}]
[null,null,null,null,{"$f":"IF(D140=\"\",\"\",VLOOKUP(D140,Preisteilnehmer!$D$7:$F$205,2))","v":""},{"$f":"IF(D140=\"\",\"\",VLOOKUP(D140,Preisteilnehmer!$D$7:$F$205,3))","v":""}]
[null,null,null,null,{"$f":"IF(D141=\"\",\"\",VLOOKUP(D141,Preisteilnehmer!$D$7:$F$205,2))","v":""},{"$f":"IF(D141=\"\",\"\",VLOOKUP(D141,Preisteilnehmer!$D$7:$F$205,3))","v":""}]
[null,null,null,null,{"$f":"IF(D142=\"\",\"\",VLOOKUP(D142,Preisteilnehmer!$D$7:$F$205,2))","v":""},{"$f":"IF(D142=\"\",\"\",VLOOKUP(D142,Preisteilnehmer!$D$7:$F$205,3))","v":""}]
[null,null,null,null,{"$f":"IF(D143=\"\",\"\",VLOOKUP(D143,Preisteilnehmer!$D$7:$F$205,2))","v":""},{"$f":"IF(D143=\"\",\"\",VLOOKUP(D143,Preisteilnehmer!$D$7:$F$205,3))","v":""}]
[null,null,null,null,{"$f":"IF(D144=\"\",\"\",VLOOKUP(D144,Preisteilnehmer!$D$7:$F$205,2))","v":""},{"$f":"IF(D144=\"\",\"\",VLOOKUP(D144,Preisteilnehmer!$D$7:$F$205,3))","v":""}]
[null,null,null,null,{"$f":"IF(D145=\"\",\"\",VLOOKUP(D145,Preisteilnehmer!$D$7:$F$205,2))","v":""},{"$f":"IF(D145=\"\",\"\",VLOOKUP(D145,Preisteilnehmer!$D$7:$F$205,3))","v":""}]
[null,null,null,null,{"$f":"IF(D146=\"\",\"\",VLOOKUP(D146,Preisteilnehmer!$D$7:$F$205,2))","v":""},{"$f":"IF(D146=\"\",\"\",VLOOKUP(D146,Preisteilnehmer!$D$7:$F$205,3))","v":""}]
[null,null,null,null,{"$f":"IF(D147=\"\",\"\",VLOOKUP(D147,Preisteilnehmer!$D$7:$F$205,2))","v":""},{"$f":"IF(D147=\"\",\"\",VLOOKUP(D147,Preisteilnehmer!$D$7:$F$205,3))","v":""}]
[null,null,null,null,{"$f":"IF(D148=\"\",\"\",VLOOKUP(D148,Preisteilnehmer!$D$7:$F$205,2))","v":""},{"$f":"IF(D148=\"\",\"\",VLOOKUP(D148,Preisteilnehmer!$D$7:$F$205,3))","v":""}]
[null,null,null,null,{"$f":"IF(D149=\"\",\"\",VLOOKUP(D149,Preisteilnehmer!$D$7:$F$205,2))","v":""},{"$f":"IF(D149=\"\",\"\",VLOOKUP(D149,Preisteilnehmer!$D$7:$F$205,3))","v":""}]
[null,null,null,null,{"$f":"IF(D150=\"\",\"\",VLOOKUP(D150,Preisteilnehmer!$D$7:$F$205,2))","v":""},{"$f":"IF(D150=\"\",\"\",VLOOKUP(D150,Preisteilnehmer!$D$7:$F$205,3))","v":""}]
[null,null,null,null,{"$f":"IF(D151=\"\",\"\",VLOOKUP(D151,Preisteilnehmer!$D$7:$F$205,2))","v":""},{"$f":"IF(D151=\"\",\"\",VLOOKUP(D151,Preisteilnehmer!$D$7:$F$205,3))","v":""}]
[null,null,null,null,{"$f":"IF(D152=\"\",\"\",VLOOKUP(D152,Preisteilnehmer!$D$7:$F$205,2))","v":""},{"$f":"IF(D152=\"\",\"\",VLOOKUP(D152,Preisteilnehmer!$D$7:$F$205,3))","v":""}]
[null,null,null,null,{"$f":"IF(D153=\"\",\"\",VLOOKUP(D153,Preisteilnehmer!$D$7:$F$205,2))","v":""},{"$f":"IF(D153=\"\",\"\",VLOOKUP(D153,Preisteilnehmer!$D$7:$F$205,3))","v":""}]
[null,null,null,null,{"$f":"IF(D154=\"\",\"\",VLOOKUP(D154,Preisteilnehmer!$D$7:$F$205,2))","v":""},{"$f":"IF(D154=\"\",\"\",VLOOKUP(D154,Preisteilnehmer!$D$7:$F$205,3))","v":""}]
[null,null,null,null,{"$f":"IF(D155=\"\",\"\",VLOOKUP(D155,Preisteilnehmer!$D$7:$F$205,2))","v":""},{"$f":"IF(D155=\"\",\"\",VLOOKUP(D155,Preisteilnehmer!$D$7:$F$205,3))","v":""}]
[null,null,null,null,{"$f":"IF(D156=\"\",\"\",VLOOKUP(D156,Preisteilnehmer!$D$7:$F$205,2))","v":""},{"$f":"IF(D156=\"\",\"\",VLOOKUP(D156,Preisteilnehmer!$D$7:$F$205,3))","v":""}]
[null,null,null,null,{"$f":"IF(D157=\"\",\"\",VLOOKUP(D157,Preisteilnehmer!$D$7:$F$205,2))","v":""},{"$f":"IF(D157=\"\",\"\",VLOOKUP(D157,Preisteilnehmer!$D$7:$F$205,3))","v":""}]
[null,null,null,null,{"$f":"IF(D158=\"\",\"\",VLOOKUP(D158,Preisteilnehmer!$D$7:$F$205,2))","v":""},{"$f":"IF(D158=\"\",\"\",VLOOKUP(D158,Preisteilnehmer!$D$7:$F$205,3))","v":""}]
[null,null,null,null,{"$f":"IF(D159=\"\",\"\",VLOOKUP(D159,Preisteilnehmer!$D$7:$F$205,2))","v":""},{"$f":"IF(D159=\"\",\"\",VLOOKUP(D159,Preisteilnehmer!$D$7:$F$205,3))","v":""}]
[null,null,null,null,{"$f":"IF(D160=\"\",\"\",VLOOKUP(D160,Preisteilnehmer!$D$7:$F$205,2))","v":""},{"$f":"IF(D160=\"\",\"\",VLOOKUP(D160,Preisteilnehmer!$D$7:$F$205,3))","v":""}]
[null,null,null,null,{"$f":"IF(D161=\"\",\"\",VLOOKUP(D161,Preisteilnehmer!$D$7:$F$205,2))","v":""},{"$f":"IF(D161=\"\",\"\",VLOOKUP(D161,Preisteilnehmer!$D$7:$F$205,3))","v":""}]
[null,null,null,null,{"$f":"IF(D162=\"\",\"\",VLOOKUP(D162,Preisteilnehmer!$D$7:$F$205,2))","v":""},{"$f":"IF(D162=\"\",\"\",VLOOKUP(D162,Preisteilnehmer!$D$7:$F$205,3))","v":""}]
[null,null,null,null,{"$f":"IF(D163=\"\",\"\",VLOOKUP(D163,Preisteilnehmer!$D$7:$F$205,2))","v":""},{"$f":"IF(D163=\"\",\"\",VLOOKUP(D163,Preisteilnehmer!$D$7:$F$205,3))","v":""}]
[null,null,null,null,{"$f":"IF(D164=\"\",\"\",VLOOKUP(D164,Preisteilnehmer!$D$7:$F$205,2))","v":""},{"$f":"IF(D164=\"\",\"\",VLOOKUP(D164,Preisteilnehmer!$D$7:$F$205,3))","v":""}]
[null,null,null,null,{"$f":"IF(D165=\"\",\"\",VLOOKUP(D165,Preisteilnehmer!$D$7:$F$205,2))","v":""},{"$f":"IF(D165=\"\",\"\",VLOOKUP(D165,Preisteilnehmer!$D$7:$F$205,3))","v":""}]
[null,null,null,null,{"$f":"IF(D166=\"\",\"\",VLOOKUP(D166,Preisteilnehmer!$D$7:$F$205,2))","v":""},{"$f":"IF(D166=\"\",\"\",VLOOKUP(D166,Preisteilnehmer!$D$7:$F$205,3))","v":""}]
[null,null,null,null,{"$f":"IF(D167=\"\",\"\",VLOOKUP(D167,Preisteilnehmer!$D$7:$F$205,2))","v":""},{"$f":"IF(D167=\"\",\"\",VLOOKUP(D167,Preisteilnehmer!$D$7:$F$205,3))","v":""}]
[null,null,null,null,{"$f":"IF(D168=\"\",\"\",VLOOKUP(D168,Preisteilnehmer!$D$7:$F$205,2))","v":""},{"$f":"IF(D168=\"\",\"\",VLOOKUP(D168,Preisteilnehmer!$D$7:$F$205,3))","v":""}]
[null,null,null,null,{"$f":"IF(D169=\"\",\"\",VLOOKUP(D169,Preisteilnehmer!$D$7:$F$205,2))","v":""},{"$f":"IF(D169=\"\",\"\",VLOOKUP(D169,Preisteilnehmer!$D$7:$F$205,3))","v":""}]
[null,null,null,null,{"$f":"IF(D170=\"\",\"\",VLOOKUP(D170,Preisteilnehmer!$D$7:$F$205,2))","v":""},{"$f":"IF(D170=\"\",\"\",VLOOKUP(D170,Preisteilnehmer!$D$7:$F$205,3))","v":""}]
[null,null,null,null,{"$f":"IF(D171=\"\",\"\",VLOOKUP(D171,Preisteilnehmer!$D$7:$F$205,2))","v":""},{"$f":"IF(D171=\"\",\"\",VLOOKUP(D171,Preisteilnehmer!$D$7:$F$205,3))","v":""}]
[null,null,null,null,{"$f":"IF(D172=\"\",\"\",VLOOKUP(D172,Preisteilnehmer!$D$7:$F$205,2))","v":""},{"$f":"IF(D172=\"\",\"\",VLOOKUP(D172,Preisteilnehmer!$D$7:$F$205,3))","v":""}]
[null,null,null,null,{"$f":"IF(D173=\"\",\"\",VLOOKUP(D173,Preisteilnehmer!$D$7:$F$205,2))","v":""},{"$f":"IF(D173=\"\",\"\",VLOOKUP(D173,Preisteilnehmer!$D$7:$F$205,3))","v":""}]
[null,null,null,null,{"$f":"IF(D174=\"\",\"\",VLOOKUP(D174,Preisteilnehmer!$D$7:$F$205,2))","v":""},{"$f":"IF(D174=\"\",\"\",VLOOKUP(D174,Preisteilnehmer!$D$7:$F$205,3))","v":""}]
[null,null,null,null,{"$f":"IF(D175=\"\",\"\",VLOOKUP(D175,Preisteilnehmer!$D$7:$F$205,2))","v":""},{"$f":"IF(D175=\"\",\"\",VLOOKUP(D175,Preisteilnehmer!$D$7:$F$205,3))","v":""}]
[null,null,null,null,{"$f":"IF(D176=\"\",\"\",VLOOKUP(D176,Preisteilnehmer!$D$7:$F$205,2))","v":""},{"$f":"IF(D176=\"\",\"\",VLOOKUP(D176,Preisteilnehmer!$D$7:$F$205,3))","v":""}]
[null,null,null,null,{"$f":"IF(D177=\"\",\"\",VLOOKUP(D177,Preisteilnehmer!$D$7:$F$205,2))","v":""},{"$f":"IF(D177=\"\",\"\",VLOOKUP(D177,Preisteilnehmer!$D$7:$F$205,3))","v":""}]
[null,null,null,null,{"$f":"IF(D178=\"\",\"\",VLOOKUP(D178,Preisteilnehmer!$D$7:$F$205,2))","v":""},{"$f":"IF(D178=\"\",\"\",VLOOKUP(D178,Preisteilnehmer!$D$7:$F$205,3))","v":""}]
[null,null,null,null,{"$f":"IF(D179=\"\",\"\",VLOOKUP(D179,Preisteilnehmer!$D$7:$F$205,2))","v":""},{"$f":"IF(D179=\"\",\"\",VLOOKUP(D179,Preisteilnehmer!$D$7:$F$205,3))","v":""}]
[null,null,null,null,{"$f":"IF(D180=\"\",\"\",VLOOKUP(D180,Preisteilnehmer!$D$7:$F$205,2))","v":""},{"$f":"IF(D180=\"\",\"\",VLOOKUP(D180,Preisteilnehmer!$D$7:$F$205,3))","v":""}]
[null,null,null,null,{"$f":"IF(D181=\"\",\"\",VLOOKUP(D181,Preisteilnehmer!$D$7:$F$205,2))","v":""},{"$f":"IF(D181=\"\",\"\",VLOOKUP(D181,Preisteilnehmer!$D$7:$F$205,3))","v":""}]
[null,null,null,null,{"$f":"IF(D182=\"\",\"\",VLOOKUP(D182,Preisteilnehmer!$D$7:$F$205,2))","v":""},{"$f":"IF(D182=\"\",\"\",VLOOKUP(D182,Preisteilnehmer!$D$7:$F$205,3))","v":""}]
[null,null,null,null,{"$f":"IF(D183=\"\",\"\",VLOOKUP(D183,Preisteilnehmer!$D$7:$F$205,2))","v":""},{"$f":"IF(D183=\"\",\"\",VLOOKUP(D183,Preisteilnehmer!$D$7:$F$205,3))","v":""}]
[null,null,null,null,{"$f":"IF(D184=\"\",\"\",VLOOKUP(D184,Preisteilnehmer!$D$7:$F$205,2))","v":""},{"$f":"IF(D184=\"\",\"\",VLOOKUP(D184,Preisteilnehmer!$D$7:$F$205,3))","v":""}]
[null,null,null,null,{"$f":"IF(D185=\"\",\"\",VLOOKUP(D185,Preisteilnehmer!$D$7:$F$205,2))","v":""},{"$f":"IF(D185=\"\",\"\",VLOOKUP(D185,Preisteilnehmer!$D$7:$F$205,3))","v":""}]
[null,null,null,null,{"$f":"IF(D186=\"\",\"\",VLOOKUP(D186,Preisteilnehmer!$D$7:$F$205,2))","v":""},{"$f":"IF(D186=\"\",\"\",VLOOKUP(D186,Preisteilnehmer!$D$7:$F$205,3))","v":""}]
[null,null,null,null,{"$f":"IF(D187=\"\",\"\",VLOOKUP(D187,Preisteilnehmer!$D$7:$F$205,2))","v":""},{"$f":"IF(D187=\"\",\"\",VLOOKUP(D187,Preisteilnehmer!$D$7:$F$205,3))","v":""}]
[null,null,null,null,{"$f":"IF(D188=\"\",\"\",VLOOKUP(D188,Preisteilnehmer!$D$7:$F$205,2))","v":""},{"$f":"IF(D188=\"\",\"\",VLOOKUP(D188,Preisteilnehmer!$D$7:$F$205,3))","v":""}]
[null,null,null,null,{"$f":"IF(D189=\"\",\"\",VLOOKUP(D189,Preisteilnehmer!$D$7:$F$205,2))","v":""},{"$f":"IF(D189=\"\",\"\",VLOOKUP(D189,Preisteilnehmer!$D$7:$F$205,3))","v":""}]
[null,null,null,null,{"$f":"IF(D190=\"\",\"\",VLOOKUP(D190,Preisteilnehmer!$D$7:$F$205,2))","v":""},{"$f":"IF(D190=\"\",\"\",VLOOKUP(D190,Preisteilnehmer!$D$7:$F$205,3))","v":""}]
[null,null,null,null,{"$f":"IF(D191=\"\",\"\",VLOOKUP(D191,Preisteilnehmer!$D$7:$F$205,2))","v":""},{"$f":"IF(D191=\"\",\"\",VLOOKUP(D191,Preisteilnehmer!$D$7:$F$205,3))","v":""}]
[null,null,null,null,{"$f":"IF(D192=\"\",\"\",VLOOKUP(D192,Preisteilnehmer!$D$7:$F$205,2))","v":""},{"$f":"IF(D192=\"\",\"\",VLOOKUP(D192,Preisteilnehmer!$D$7:$F$205,3))","v":""}]
[null,null,null,null,{"$f":"IF(D193=\"\",\"\",VLOOKUP(D193,Preisteilnehmer!$D$7:$F$205,2))","v":""},{"$f":"IF(D193=\"\",\"\",VLOOKUP(D193,Preisteilnehmer!$D$7:$F$205,3))","v":""}]
[null,null,null,null,{"$f":"IF(D194=\"\",\"\",VLOOKUP(D194,Preisteilnehmer!$D$7:$F$205,2))","v":""},{"$f":"IF(D194=\"\",\"\",VLOOKUP(D194,Preisteilnehmer!$D$7:$F$205,3))","v":""}]
[null,null,null,null,{"$f":"IF(D195=\"\",\"\",VLOOKUP(D195,Preisteilnehmer!$D$7:$F$205,2))","v":""},{"$f":"IF(D195=\"\",\"\",VLOOKUP(D195,Preisteilnehmer!$D$7:$F$205,3))","v":""}]
[null,null,null,null,{"$f":"IF(D196=\"\",\"\",VLOOKUP(D196,Preisteilnehmer!$D$7:$F$205,2))","v":""},{"$f":"IF(D196=\"\",\"\",VLOOKUP(D196,Preisteilnehmer!$D$7:$F$205,3))","v":""}]
[null,null,null,null,{"$f":"IF(D197=\"\",\"\",VLOOKUP(D197,Preisteilnehmer!$D$7:$F$205,2))","v":""},{"$f":"IF(D197=\"\",\"\",VLOOKUP(D197,Preisteilnehmer!$D$7:$F$205,3))","v":""}]
[null,null,null,null,{"$f":"IF(D198=\"\",\"\",VLOOKUP(D198,Preisteilnehmer!$D$7:$F$205,2))","v":""},{"$f":"IF(D198=\"\",\"\",VLOOKUP(D198,Preisteilnehmer!$D$7:$F$205,3))","v":""}]
[null,null,null,null,{"$f":"IF(D199=\"\",\"\",VLOOKUP(D199,Preisteilnehmer!$D$7:$F$205,2))","v":""},{"$f":"IF(D199=\"\",\"\",VLOOKUP(D199,Preisteilnehmer!$D$7:$F$205,3))","v":""}]
[null,null,null,null,{"$f":"IF(D200=\"\",\"\",VLOOKUP(D200,Preisteilnehmer!$D$7:$F$205,2))","v":""},{"$f":"IF(D200=\"\",\"\",VLOOKUP(D200,Preisteilnehmer!$D$7:$F$205,3))","v":""}]
[null,null,null,null,{"$f":"IF(D201=\"\",\"\",VLOOKUP(D201,Preisteilnehmer!$D$7:$F$205,2))","v":""},{"$f":"IF(D201=\"\",\"\",VLOOKUP(D201,Preisteilnehmer!$D$7:$F$205,3))","v":""}]
[null,null,null,null,{"$f":"IF(D202=\"\",\"\",VLOOKUP(D202,Preisteilnehmer!$D$7:$F$205,2))","v":""},{"$f":"IF(D202=\"\",\"\",VLOOKUP(D202,Preisteilnehmer!$D$7:$F$205,3))","v":""}]

{"sheet":"Ergebnisse","index":2,"n_rows":47,"n_cols":9,"rows_kept":47,"cut":false,"hidden":false,"merged":[[42,2,42,5],[42,7,42,8],[44,2,44,5],[44,7,44,8],[45,2,45,5],[45,7,45,8],[46,2,46,5],[46,7,46,8],[39,2,39,5],[40,2,40,5],[41,2,41,5],[39,7,39,8],[40,7,40,8],[41,7,41,8],[37,7,37,8],[38,7,38,8],[31,4,31,5],[18,4,18,5],[24,4,24,5],[25,4,25,5],[38,2,38,5],[43,7,43,8],[2,0,3,8],[17,0,17,2],[11,0,11,2],[5,0,5,2],[4,0,4,7],[6,4,6,5],[30,4,30,5],[29,0,29,2],[23,0,23,2],[43,2,43,5],[7,4,7,5],[13,4,13,5],[19,4,19,5],[12,4,12,5],[37,2,37,5]]}
[]
[]
["Vier Vereineschießen"]
[]
[{"$f":"CONCATENATE(\"Ergebnisse vom\",\" \",Preisteilnehmer!B5,\" \",\"in\",\" \",Preisteilnehmer!B6)","v":"Ergebnisse vom ??? in XX.XX.20XX"}]
["Schützen Auflage"]
[null,"Verein :","Ringe :","M-Teiler:","Bester Einzelschütze :",null,"Verein :","Ringe :","Teiler:"]
["1.",{"$f":"D!A3","v":"Soderstorf keine Teilnahme"},{"$f":"D!B3","v":0},{"$f":"D!C3","v":0},{"$f":"D!G3","v":""},null,{"$f":"D!F3","v":""},{"$f":"D!H3","v":0},{"$f":"D!I3","v":""}]
["2.",{"$f":"D!A4","v":"Wetzen keine Teilnahme"},{"$f":"D!B4","v":0},{"$f":"D!C4","v":0}]
["3.",{"$f":"D!A5","v":"Eyendorf keine Teilnahme"},{"$f":"D!B5","v":0},{"$f":"D!C5","v":0}]
["4.",{"$f":"D!A6","v":"Raven-Rolfsen keine Teilnahme"},{"$f":"D!B6","v":0},{"$f":"D!C6","v":0}]
["Damen"]
[null,"Verein :","Ringe :","M-Teiler:","Beste Einzelschützin :",null,"Verein :","Ringe :","Teiler:"]
["1.",{"$f":"D!A9","v":"Soderstorf keine Teilnahme"},{"$f":"D!B9","v":0},{"$f":"D!C9","v":0},{"$f":"D!G9","v":""},null,{"$f":"D!F9","v":""},{"$f":"D!H9","v":0},{"$f":"D!I9","v":""}]
["2.",{"$f":"D!A10","v":"Wetzen keine Teilnahme"},{"$f":"D!B10","v":0},{"$f":"D!C10","v":0}]
["3.",{"$f":"D!A11","v":"Eyendorf keine Teilnahme"},{"$f":"D!B11","v":0},{"$f":"D!C11","v":0}]
["4.",{"$f":"D!A12","v":"Raven-Rolfsen keine Teilnahme"},{"$f":"D!B12","v":0},{"$f":"D!C12","v":0}]
["Altersklasse Auflage"]
[null,"Verein :","Ringe :","M-Teiler:","Bester Einzelschütze :",null,"Verein :","Ringe :","Teiler:"]
["1.",{"$f":"D!A15","v":"Soderstorf keine Teilnahme"},{"$f":"D!B15","v":0},{"$f":"D!C15","v":0},{"$f":"D!G15","v":""},null,{"$f":"D!F15","v":""},{"$f":"D!H15","v":0},{"$f":"D!I15","v":""}]
["2.",{"$f":"D!A16","v":"Wetzen keine Teilnahme"},{"$f":"D!B16","v":0},{"$f":"D!C16","v":0}]
["3.",{"$f":"D!A17","v":"Eyendorf keine Teilnahme"},{"$f":"D!B17","v":0},{"$f":"D!C17","v":0}]
["4.",{"$f":"D!A18","v":"Raven-Rolfsen keine Teilnahme"},{"$f":"D!B18","v":0},{"$f":"D!C18","v":0}]
["Freihand"]
[null,"Verein :","Ringe :","M-Teiler:","Bester Einzelschütze :",null,"Verein :","Ringe :","Teiler:"]
["1.",{"$f":"D!A21","v":"Soderstorf keine Teilnahme"},{"$f":"D!B21","v":0},{"$f":"D!C21","v":0},{"$f":"D!G21","v":""},null,{"$f":"D!F21","v":""},{"$f":"D!H21","v":0},{"$f":"D!I21","v":""}]
["2.",{"$f":"D!A22","v":"Wetzen keine Teilnahme"},{"$f":"D!B22","v":0},{"$f":"D!C22","v":0}]
["3.",{"$f":"D!A23","v":"Eyendorf keine Teilnahme"},{"$f":"D!B23","v":0},{"$f":"D!C23","v":0}]
["4.",{"$f":"D!A24","v":"Raven-Rolfsen keine Teilnahme"},{"$f":"D!B24","v":0},{"$f":"D!C24","v":0}]
["Jugend"]
[null,"Verein :","Ringe :","M-Teiler:","Bester Einzelschütze :",null,"Verein :","Ringe :","Teiler:"]
["1.",{"$f":"D!A27","v":"Soderstorf keine Teilnahme"},{"$f":"D!B27","v":0},{"$f":"D!C27","v":0},{"$f":"D!G27","v":""},null,{"$f":"D!F27","v":""},{"$f":"D!H27","v":0},{"$f":"D!I27","v":""}]
["2.",{"$f":"D!A28","v":"Wetzen keine Teilnahme"},{"$f":"D!B28","v":0},{"$f":"D!C28","v":0}]
["3.",{"$f":"D!A29","v":"Eyendorf keine Teilnahme"},{"$f":"D!B29","v":0},{"$f":"D!C29","v":0}]
["4.",{"$f":"D!A30","v":"Raven-Rolfsen keine Teilnahme"},{"$f":"D!B30","v":0},{"$f":"D!C30","v":0}]
[]
[]
[null,null,"Name :",null,null,null,"Verein :","Teiler:"]
["1.","Viervereinekönig :",{"$f":"D!L3","v":""},null,null,null,{"$f":"D!K3","v":""},{"$f":"D!M3","v":""}]
[null,null,{"$f":"D!L4","v":""},null,null,null,{"$f":"D!K4","v":""},{"$f":"D!M4","v":""}]
[null,null,{"$f":"D!L5","v":""},null,null,null,{"$f":"D!K5","v":""},{"$f":"D!M5","v":""}]
[null,null,{"$f":"D!L6","v":""},null,null,null,{"$f":"D!K6","v":""},{"$f":"D!M6","v":""}]
[null,null,"Name :",null,null,null,"Verein :","Teiler:"]
["1.","Viervereinekönigin :",{"$f":"D!L10","v":""},null,null,null,{"$f":"D!K10","v":""},{"$f":"D!M10","v":""}]
[null,null,{"$f":"D!L11","v":""},null,null,null,{"$f":"D!K11","v":""},{"$f":"D!M11","v":""}]
[null,null,{"$f":"D!L12","v":""},null,null,null,{"$f":"D!K12","v":""},{"$f":"D!M12","v":""}]
[null,null,{"$f":"D!L13","v":""},null,null,null,{"$f":"D!K13","v":""},{"$f":"D!M13","v":""}]

{"sheet":"Ergebnisse Preisschießen","index":3,"n_rows":36,"n_cols":5,"rows_kept":36,"cut":false,"hidden":false,"merged":[[4,1,4,2],[0,1,0,2]]}
[null,"Vier-Vereine "]
[]
[]
[null,null,"Preisschießen"]
[null,{"$f":"CONCATENATE(Preisteilnehmer!G14,\" \",Preisteilnehmer!G15)","v":" "}]
[null,"Platz :","Name :","Teiler","Verein :"]
[null,{"$f":"IF(C7=\"\",\"\",\"1.)\")","v":""},{"$f":"IF(D!P3=\"\",\"\",D!P3)","v":""},{"$f":"IF(D!R3=\"\",\"\",D!R3)","v":""},{"$f":"IF(D!Q3=\"\",\"\",D!Q3)","v":""}]
[null,{"$f":"IF(C8=\"\",\"\",\"2.)\")","v":""},{"$f":"IF(D!P4=\"\",\"\",D!P4)","v":""},{"$f":"IF(D!R4=\"\",\"\",D!R4)","v":""},{"$f":"IF(D!Q4=\"\",\"\",D!Q4)","v":""}]
[null,{"$f":"IF(C9=\"\",\"\",\"3.)\")","v":""},{"$f":"IF(D!P5=\"\",\"\",D!P5)","v":""},{"$f":"IF(D!R5=\"\",\"\",D!R5)","v":""},{"$f":"IF(D!Q5=\"\",\"\",D!Q5)","v":""}]
[null,{"$f":"IF(C10=\"\",\"\",\"4.)\")","v":""},{"$f":"IF(D!P6=\"\",\"\",D!P6)","v":""},{"$f":"IF(D!R6=\"\",\"\",D!R6)","v":""},{"$f":"IF(D!Q6=\"\",\"\",D!Q6)","v":""}]
[null,{"$f":"IF(C11=\"\",\"\",\"5.)\")","v":""},{"$f":"IF(D!P7=\"\",\"\",D!P7)","v":""},{"$f":"IF(D!R7=\"\",\"\",D!R7)","v":""},{"$f":"IF(D!Q7=\"\",\"\",D!Q7)","v":""}]
[null,{"$f":"IF(C12=\"\",\"\",\"6.)\")","v":""},{"$f":"IF(D!P8=\"\",\"\",D!P8)","v":""},{"$f":"IF(D!R8=\"\",\"\",D!R8)","v":""},{"$f":"IF(D!Q8=\"\",\"\",D!Q8)","v":""}]
[null,{"$f":"IF(C13=\"\",\"\",\"7.)\")","v":""},{"$f":"IF(D!P9=\"\",\"\",D!P9)","v":""},{"$f":"IF(D!R9=\"\",\"\",D!R9)","v":""},{"$f":"IF(D!Q9=\"\",\"\",D!Q9)","v":""}]
[null,{"$f":"IF(C14=\"\",\"\",\"8.)\")","v":""},{"$f":"IF(D!P10=\"\",\"\",D!P10)","v":""},{"$f":"IF(D!R10=\"\",\"\",D!R10)","v":""},{"$f":"IF(D!Q10=\"\",\"\",D!Q10)","v":""}]
[null,{"$f":"IF(C15=\"\",\"\",\"9.)\")","v":""},{"$f":"IF(D!P11=\"\",\"\",D!P11)","v":""},{"$f":"IF(D!R11=\"\",\"\",D!R11)","v":""},{"$f":"IF(D!Q11=\"\",\"\",D!Q11)","v":""}]
[null,{"$f":"IF(C16=\"\",\"\",\"10.)\")","v":""},{"$f":"IF(D!P12=\"\",\"\",D!P12)","v":""},{"$f":"IF(D!R12=\"\",\"\",D!R12)","v":""},{"$f":"IF(D!Q12=\"\",\"\",D!Q12)","v":""}]
[null,{"$f":"IF(C17=\"\",\"\",\"11.)\")","v":""},{"$f":"IF(D!P13=\"\",\"\",D!P13)","v":""},{"$f":"IF(D!R13=\"\",\"\",D!R13)","v":""},{"$f":"IF(D!Q13=\"\",\"\",D!Q13)","v":""}]
[null,{"$f":"IF(C18=\"\",\"\",\"12.)\")","v":""},{"$f":"IF(D!P14=\"\",\"\",D!P14)","v":""},{"$f":"IF(D!R14=\"\",\"\",D!R14)","v":""},{"$f":"IF(D!Q14=\"\",\"\",D!Q14)","v":""}]
[null,{"$f":"IF(C19=\"\",\"\",\"13.)\")","v":""},{"$f":"IF(D!P15=\"\",\"\",D!P15)","v":""},{"$f":"IF(D!R15=\"\",\"\",D!R15)","v":""},{"$f":"IF(D!Q15=\"\",\"\",D!Q15)","v":""}]
[null,{"$f":"IF(C20=\"\",\"\",\"14.)\")","v":""},{"$f":"IF(D!P16=\"\",\"\",D!P16)","v":""},{"$f":"IF(D!R16=\"\",\"\",D!R16)","v":""},{"$f":"IF(D!Q16=\"\",\"\",D!Q16)","v":""}]
[null,{"$f":"IF(C21=\"\",\"\",\"15.)\")","v":""},{"$f":"IF(D!P17=\"\",\"\",D!P17)","v":""},{"$f":"IF(D!R17=\"\",\"\",D!R17)","v":""},{"$f":"IF(D!Q17=\"\",\"\",D!Q17)","v":""}]
[null,{"$f":"IF(C22=\"\",\"\",\"16.)\")","v":""},{"$f":"IF(D!P18=\"\",\"\",D!P18)","v":""},{"$f":"IF(D!R18=\"\",\"\",D!R18)","v":""},{"$f":"IF(D!Q18=\"\",\"\",D!Q18)","v":""}]
[null,{"$f":"IF(C23=\"\",\"\",\"17.)\")","v":""},{"$f":"IF(D!P19=\"\",\"\",D!P19)","v":""},{"$f":"IF(D!R19=\"\",\"\",D!R19)","v":""},{"$f":"IF(D!Q19=\"\",\"\",D!Q19)","v":""}]
[null,{"$f":"IF(C24=\"\",\"\",\"18.)\")","v":""},{"$f":"IF(D!P20=\"\",\"\",D!P20)","v":""},{"$f":"IF(D!R20=\"\",\"\",D!R20)","v":""},{"$f":"IF(D!Q20=\"\",\"\",D!Q20)","v":""}]
[null,{"$f":"IF(C25=\"\",\"\",\"19.)\")","v":""},{"$f":"IF(D!P21=\"\",\"\",D!P21)","v":""},{"$f":"IF(D!R21=\"\",\"\",D!R21)","v":""},{"$f":"IF(D!Q21=\"\",\"\",D!Q21)","v":""}]
[null,{"$f":"IF(C26=\"\",\"\",\"20.)\")","v":""},{"$f":"IF(D!P22=\"\",\"\",D!P22)","v":""},{"$f":"IF(D!R22=\"\",\"\",D!R22)","v":""},{"$f":"IF(D!Q22=\"\",\"\",D!Q22)","v":""}]
[null,{"$f":"IF(C27=\"\",\"\",\"21.)\")","v":""},{"$f":"IF(D!P23=\"\",\"\",D!P23)","v":""},{"$f":"IF(D!R23=\"\",\"\",D!R23)","v":""},{"$f":"IF(D!Q23=\"\",\"\",D!Q23)","v":""}]
[null,{"$f":"IF(C28=\"\",\"\",\"22.)\")","v":""},{"$f":"IF(D!P24=\"\",\"\",D!P24)","v":""},{"$f":"IF(D!R24=\"\",\"\",D!R24)","v":""},{"$f":"IF(D!Q24=\"\",\"\",D!Q24)","v":""}]
[null,{"$f":"IF(C29=\"\",\"\",\"23.)\")","v":""},{"$f":"IF(D!P25=\"\",\"\",D!P25)","v":""},{"$f":"IF(D!R25=\"\",\"\",D!R25)","v":""},{"$f":"IF(D!Q25=\"\",\"\",D!Q25)","v":""}]
[null,{"$f":"IF(C30=\"\",\"\",\"24.)\")","v":""},{"$f":"IF(D!P26=\"\",\"\",D!P26)","v":""},{"$f":"IF(D!R26=\"\",\"\",D!R26)","v":""},{"$f":"IF(D!Q26=\"\",\"\",D!Q26)","v":""}]
[null,{"$f":"IF(C31=\"\",\"\",\"25.)\")","v":""},{"$f":"IF(D!P27=\"\",\"\",D!P27)","v":""},{"$f":"IF(D!R27=\"\",\"\",D!R27)","v":""},{"$f":"IF(D!Q27=\"\",\"\",D!Q27)","v":""}]
[null,{"$f":"IF(C32=\"\",\"\",\"26.)\")","v":""},{"$f":"IF(D!P28=\"\",\"\",D!P28)","v":""},{"$f":"IF(D!R28=\"\",\"\",D!R28)","v":""},{"$f":"IF(D!Q28=\"\",\"\",D!Q28)","v":""}]
[null,{"$f":"IF(C33=\"\",\"\",\"27.)\")","v":""},{"$f":"IF(D!P29=\"\",\"\",D!P29)","v":""},{"$f":"IF(D!R29=\"\",\"\",D!R29)","v":""},{"$f":"IF(D!Q29=\"\",\"\",D!Q29)","v":""}]
[null,{"$f":"IF(C34=\"\",\"\",\"28.)\")","v":""},{"$f":"IF(D!P30=\"\",\"\",D!P30)","v":""},{"$f":"IF(D!R30=\"\",\"\",D!R30)","v":""},{"$f":"IF(D!Q30=\"\",\"\",D!Q30)","v":""}]
[null,{"$f":"IF(C35=\"\",\"\",\"29.)\")","v":""},{"$f":"IF(D!P31=\"\",\"\",D!P31)","v":""},{"$f":"IF(D!R31=\"\",\"\",D!R31)","v":""},{"$f":"IF(D!Q31=\"\",\"\",D!Q31)","v":""}]
[null,{"$f":"IF(C36=\"\",\"\",\"30.)\")","v":""},{"$f":"IF(D!P32=\"\",\"\",D!P32)","v":""},{"$f":"IF(D!R32=\"\",\"\",D!R32)","v":""},{"$f":"IF(D!Q32=\"\",\"\",D!Q32)","v":""}]

{"sheet":"Eyendorf","index":4,"n_rows":56,"n_cols":16,"rows_kept":56,"cut":false,"hidden":false,"merged":[[17,0,17,13],[33,7,33,8],[42,2,42,5],[42,7,42,8],[35,0,35,13],[42,10,42,11],[33,10,33,11],[26,0,26,13],[24,2,24,5],[24,7,24,8],[24,10,24,11],[33,2,33,5],[0,0,0,12],[1,10,1,11],[15,10,15,11],[15,2,15,5],[15,7,15,8],[3,0,3,13],[1,2,1,5],[56,0,56,1],[53,2,53,3],[54,2,54,3],[55,2,55,3],[56,2,56,3],[44,0,44,13],[53,0,53,1],[54,0,54,1],[55,0,55,1],[51,2,51,5],[51,7,51,8],[51,10,51,11]]}
[{"$f":"\"Vier Vereineschießen in\"&\" \"&Preisteilnehmer!$B$5","v":"Vier Vereineschießen in ???"}]
[null,"Verein:","Eyendorf",null,null,null,null,null,null,null,"Datum:",null,{"$f":"Preisteilnehmer!$B$6","v":"XX.XX.20XX"},null,{"$f":"MAX(M6:M15)","v":0},{"$f":"INDEX(N6:N15,MATCH(O2&MIN(IF(M6:M15=O2,N6:N15)),M6:M15&N6:N15,0))","v":{"$error":"#N/A"}}]
[]
["Schützen Standauflage"]
[null,"Name:",1,2,3,4,5,6,7,8,9,10,"Summe:","Teiler"]
[1,null,null,null,null,null,null,null,null,null,null,null,{"$f":"IF(SUM(C6:L6)=0,\"\",SUM(C6:L6))","v":""}]
[2,null,null,null,null,null,null,null,null,null,null,null,""]
[3,null,null,null,null,null,null,null,null,null,null,null,""]
[4,null,null,null,null,null,null,null,null,null,null,null,""]
[5,null,null,null,null,null,null,null,null,null,null,null,""]
[6,null,null,null,null,null,null,null,null,null,null,null,""]
[7,null,null,null,null,null,null,null,null,null,null,null,""]
[8,null,null,null,null,null,null,null,null,null,null,null,""]
[9,null,null,null,null,null,null,null,null,null,null,null,""]
[10,null,null,null,null,null,null,null,null,null,null,null,""]
[null,"Bester Einzelschütze/in:",{"$f":"IF(ISERROR(P2),\"\",LOOKUP(2,1/(M6:M15&\"*\"&N6:N15=O2&\"*\"&P2),B6:B15))","v":""},null,null,null,{"$f":"IF(ISERROR(P2),\"\",O2)","v":""},"Ringe",null,null,"gesamt:",null,{"$f":"IF(SUM(M6:M15)=0,\"\",SUM(M6:M15))","v":""},{"$f":"MIN(N6:N15)","v":0}]
[]
["Damen",null,null,null,null,null,null,null,null,null,null,null,null,null,{"$f":"MAX(M20:M24)","v":0},{"$f":"INDEX(N20:N24,MATCH(O18&MIN(IF(M20:M24=O18,N20:N24)),M20:M24&N20:N24,0))","v":{"$error":"#N/A"}}]
[null,"Name:",1,2,3,4,5,6,7,8,9,10,"Summe:","Teiler"]
[1,null,null,null,null,null,null,null,null,null,null,null,{"$f":"IF(SUM(C20:L20)=0,\"\",SUM(C20:L20))","v":""}]
[2,null,null,null,null,null,null,null,null,null,null,null,{"$f":"IF(SUM(C21:L21)=0,\"\",SUM(C21:L21))","v":""}]
[3,null,null,null,null,null,null,null,null,null,null,null,{"$f":"IF(SUM(C22:L22)=0,\"\",SUM(C22:L22))","v":""}]
[4,null,null,null,null,null,null,null,null,null,null,null,{"$f":"IF(SUM(C23:L23)=0,\"\",SUM(C23:L23))","v":""}]
[5,null,null,null,null,null,null,null,null,null,null,null,{"$f":"IF(SUM(C24:L24)=0,\"\",SUM(C24:L24))","v":""}]
[null,"Bester Einzelschütze/in:",{"$f":"IF(ISERROR(P18),\"\",LOOKUP(2,1/(M20:M24&\"*\"&N20:N24=O18&\"*\"&P18),B20:B24))","v":""},null,null,null,{"$f":"IF(ISERROR(P18),\"\",O18)","v":""},"Ringe",null,null,"gesamt:",null,{"$f":"IF(SUM(M20:M24)=0,\"\",SUM(M20:M24))","v":""},{"$f":"MIN(N20:N24)","v":0}]
[]
["Altersklasse Auflage",null,null,null,null,null,null,null,null,null,null,null,null,null,{"$f":"MAX(M29:M33)","v":0},{"$f":"INDEX(N29:N33,MATCH(O27&MIN(IF(M29:M33=O27,N29:N33)),M29:M33&N29:N33,0))","v":{"$error":"#N/A"}}]
[null,"Name:",1,2,3,4,5,6,7,8,9,10,"Summe:","Teiler"]
[1,null,null,null,null,null,null,null,null,null,null,null,{"$f":"IF(SUM(C29:L29)=0,\"\",SUM(C29:L29))","v":""}]
[2,null,null,null,null,null,null,null,null,null,null,null,{"$f":"IF(SUM(C30:L30)=0,\"\",SUM(C30:L30))","v":""}]
[3,null,null,null,null,null,null,null,null,null,null,null,{"$f":"IF(SUM(C31:L31)=0,\"\",SUM(C31:L31))","v":""}]
[4,null,null,null,null,null,null,null,null,null,null,null,{"$f":"IF(SUM(C32:L32)=0,\"\",SUM(C32:L32))","v":""}]
[5,null,null,null,null,null,null,null,null,null,null,null,{"$f":"IF(SUM(C33:L33)=0,\"\",SUM(C33:L33))","v":""}]
[null,"Beste Einzelschützin:",{"$f":"IF(ISERROR(P27),\"\",LOOKUP(2,1/(M29:M33&\"*\"&N29:N33=O27&\"*\"&P27),B29:B33))","v":""},null,null,null,{"$f":"IF(ISERROR(P27),\"\",O27)","v":""},"Ringe",null,null,"gesamt:",null,{"$f":"IF(SUM(M29:M33)=0,\"\",SUM(M29:M33))","v":""},{"$f":"MIN(N29:N33)","v":0}]
[]
["Freihand",null,null,null,null,null,null,null,null,null,null,null,null,null,{"$f":"MAX(M38:M42)","v":0},{"$f":"INDEX(N38:N42,MATCH(O36&MIN(IF(M38:M42=O36,N38:N42)),M38:M42&N38:N42,0))","v":{"$error":"#N/A"}}]
[null,"Name:",1,2,3,4,5,6,7,8,9,10,"Summe:","Teiler"]
[1,null,null,null,null,null,null,null,null,null,null,null,{"$f":"IF(SUM(C38:L38)=0,\"\",SUM(C38:L38))","v":""},0]
[2,null,null,null,null,null,null,null,null,null,null,null,{"$f":"IF(SUM(C39:L39)=0,\"\",SUM(C39:L39))","v":""},0]
[3,null,null,null,null,null,null,null,null,null,null,null,{"$f":"IF(SUM(C40:L40)=0,\"\",SUM(C40:L40))","v":""},0]
[4,null,null,null,null,null,null,null,null,null,null,null,{"$f":"IF(SUM(C41:L41)=0,\"\",SUM(C41:L41))","v":""},0]
[5,null,null,null,null,null,null,null,null,null,null,null,{"$f":"IF(SUM(C42:L42)=0,\"\",SUM(C42:L42))","v":""},0]
[null,"Bester Einzelschütze/in:",{"$f":"IF(ISERROR(P36),\"\",LOOKUP(2,1/(M38:M42&\"*\"&N38:N42=O36&\"*\"&P36),B38:B42))","v":""},null,null,null,{"$f":"IF(SUM(M38:M42)=0,\"\",O36)","v":""},"Ringe",null,null,"gesamt:",null,{"$f":"IF(SUM(M38:M42)=0,\"\",SUM(M38:M42))","v":""},{"$f":"MIN(N38:N42)","v":0}]
[]
["Jugend",null,null,null,null,null,null,null,null,null,null,null,null,null,{"$f":"MAX(M47:M51)","v":0},{"$f":"INDEX(N47:N51,MATCH(O45&MIN(IF(M47:M51=O45,N47:N51)),M47:M51&N47:N51,0))","v":{"$error":"#N/A"}}]
[null,"Name:",1,2,3,4,5,6,7,8,9,10,"Summe:","Teiler"]
[1,null,null,null,null,null,null,null,null,null,null,null,{"$f":"IF(SUM(C47:L47)=0,\"\",SUM(C47:L47))","v":""},0]
[2,null,null,null,null,null,null,null,null,null,null,null,{"$f":"IF(SUM(C48:L48)=0,\"\",SUM(C48:L48))","v":""},0]
[3,null,null,null,null,null,null,null,null,null,null,null,{"$f":"IF(SUM(C49:L49)=0,\"\",SUM(C49:L49))","v":""},0]
[4,null,null,null,null,null,null,null,null,null,null,null,{"$f":"IF(SUM(C50:L50)=0,\"\",SUM(C50:L50))","v":""},0]
[5,null,null,null,null,null,null,null,null,null,null,null,{"$f":"IF(SUM(C51:L51)=0,\"\",SUM(C51:L51))","v":""},0]
[null,"Bester Einzelschütze/in:",{"$f":"IF(ISERROR(P45),\"\",LOOKUP(2,1/(M47:M51&\"*\"&N47:N51=O45&\"*\"&P45),B47:B51))","v":""},null,null,null,{"$f":"IF(SUM(M47:M51)=0,\"\",O45)","v":""},"Ringe",null,null,"gesamt:",null,{"$f":"IF(SUM(M47:M51)=0,\"\",SUM(M47:M51))","v":""},{"$f":"MIN(N47:N51)","v":0}]
[]
["Name des Königs:",null,"Teiler"]
[]
["Name der Königin:",null,"Teiler"]

{"sheet":"Raven-Rolfsen","index":5,"n_rows":56,"n_cols":16,"rows_kept":56,"cut":false,"hidden":false,"merged":[[51,10,51,11],[44,0,44,13],[51,2,51,5],[33,2,33,5],[33,7,33,8],[42,2,42,5],[42,7,42,8],[51,7,51,8],[42,10,42,11],[0,0,0,12],[1,10,1,11],[15,10,15,11],[15,2,15,5],[15,7,15,8],[3,0,3,13],[17,0,17,13],[26,0,26,13],[35,0,35,13],[1,2,1,5],[33,10,33,11],[24,2,24,5],[24,7,24,8],[24,10,24,11],[53,0,53,1],[54,0,54,1],[55,0,55,1],[56,0,56,1],[53,2,53,3],[54,2,54,3],[55,2,55,3],[56,2,56,3]]}
[{"$f":"\"Vier Vereineschießen in\"&\" \"&Preisteilnehmer!$B$5","v":"Vier Vereineschießen in ???"}]
[null,"Verein:","Raven - Rolfsen",null,null,null,null,null,null,null,"Datum:",null,{"$f":"Preisteilnehmer!$B$6","v":"XX.XX.20XX"},null,{"$f":"MAX(M6:M15)","v":0},{"$f":"INDEX(N6:N15,MATCH(O2&MIN(IF(M6:M15=O2,N6:N15)),M6:M15&N6:N15,0))","v":{"$error":"#N/A"}}]
[]
["Schützen Standauflage"]
[null,"Name:",1,2,3,4,5,6,7,8,9,10,"Summe:","Teiler"]
[1,null,null,null,null,null,null,null,null,null,null,null,{"$f":"IF(SUM(C6:L6)=0,\"\",SUM(C6:L6))","v":""}]
[2,null,null,null,null,null,null,null,null,null,null,null,""]
[3,null,null,null,null,null,null,null,null,null,null,null,""]
[4,null,null,null,null,null,null,null,null,null,null,null,""]
[5,null,null,null,null,null,null,null,null,null,null,null,""]
[6,null,null,null,null,null,null,null,null,null,null,null,""]
[7,null,null,null,null,null,null,null,null,null,null,null,""]
[8,null,null,null,null,null,null,null,null,null,null,null,""]
[9,null,null,null,null,null,null,null,null,null,null,null,""]
[10,null,null,null,null,null,null,null,null,null,null,null,""]
[null,"Bester Einzelschütze/in:",{"$f":"IF(ISERROR(P2),\"\",LOOKUP(2,1/(M6:M15&\"*\"&N6:N15=O2&\"*\"&P2),B6:B15))","v":""},null,null,null,{"$f":"IF(ISERROR(P2),\"\",O2)","v":""},"Ringe",null,null,"gesamt:",null,{"$f":"IF(SUM(M6:M15)=0,\"\",SUM(M6:M15))","v":""},{"$f":"MIN(N6:N15)","v":0}]
[]
["Damen",null,null,null,null,null,null,null,null,null,null,null,null,null,{"$f":"MAX(M20:M24)","v":0},{"$f":"INDEX(N20:N24,MATCH(O18&MIN(IF(M20:M24=O18,N20:N24)),M20:M24&N20:N24,0))","v":{"$error":"#N/A"}}]
[null,"Name:",1,2,3,4,5,6,7,8,9,10,"Summe:","Teiler"]
[1,null,null,null,null,null,null,null,null,null,null,null,{"$f":"IF(SUM(C20:L20)=0,\"\",SUM(C20:L20))","v":""}]
[2,null,null,null,null,null,null,null,null,null,null,null,{"$f":"IF(SUM(C21:L21)=0,\"\",SUM(C21:L21))","v":""}]
[3,null,null,null,null,null,null,null,null,null,null,null,{"$f":"IF(SUM(C22:L22)=0,\"\",SUM(C22:L22))","v":""}]
[4,null,null,null,null,null,null,null,null,null,null,null,{"$f":"IF(SUM(C23:L23)=0,\"\",SUM(C23:L23))","v":""}]
[5,null,null,null,null,null,null,null,null,null,null,null,{"$f":"IF(SUM(C24:L24)=0,\"\",SUM(C24:L24))","v":""}]
[null,"Bester Einzelschütze/in:",{"$f":"IF(ISERROR(P18),\"\",LOOKUP(2,1/(M20:M24&\"*\"&N20:N24=O18&\"*\"&P18),B20:B24))","v":""},null,null,null,{"$f":"IF(ISERROR(P18),\"\",O18)","v":""},"Ringe",null,null,"gesamt:",null,{"$f":"IF(SUM(M20:M24)=0,\"\",SUM(M20:M24))","v":""},{"$f":"MIN(N20:N24)","v":0}]
[]
["Altersklasse Auflage",null,null,null,null,null,null,null,null,null,null,null,null,null,{"$f":"MAX(M29:M33)","v":0},{"$f":"INDEX(N29:N33,MATCH(O27&MIN(IF(M29:M33=O27,N29:N33)),M29:M33&N29:N33,0))","v":{"$error":"#N/A"}}]
[null,"Name:",1,2,3,4,5,6,7,8,9,10,"Summe:","Teiler"]
[1,null,null,null,null,null,null,null,null,null,null,null,{"$f":"IF(SUM(C29:L29)=0,\"\",SUM(C29:L29))","v":""}]
[2,null,null,null,null,null,null,null,null,null,null,null,{"$f":"IF(SUM(C30:L30)=0,\"\",SUM(C30:L30))","v":""}]
[3,null,null,null,null,null,null,null,null,null,null,null,{"$f":"IF(SUM(C31:L31)=0,\"\",SUM(C31:L31))","v":""}]
[4,null,null,null,null,null,null,null,null,null,null,null,{"$f":"IF(SUM(C32:L32)=0,\"\",SUM(C32:L32))","v":""}]
[5,null,null,null,null,null,null,null,null,null,null,null,{"$f":"IF(SUM(C33:L33)=0,\"\",SUM(C33:L33))","v":""}]
[null,"Beste Einzelschützin:",{"$f":"IF(ISERROR(P27),\"\",LOOKUP(2,1/(M29:M33&\"*\"&N29:N33=O27&\"*\"&P27),B29:B33))","v":""},null,null,null,{"$f":"IF(ISERROR(P27),\"\",O27)","v":""},"Ringe",null,null,"gesamt:",null,{"$f":"IF(SUM(M29:M33)=0,\"\",SUM(M29:M33))","v":""},{"$f":"MIN(N29:N33)","v":0}]
[]
["Freihand",null,null,null,null,null,null,null,null,null,null,null,null,null,{"$f":"MAX(M38:M42)","v":0},{"$f":"INDEX(N38:N42,MATCH(O36&MIN(IF(M38:M42=O36,N38:N42)),M38:M42&N38:N42,0))","v":{"$error":"#N/A"}}]
[null,"Name:",1,2,3,4,5,6,7,8,9,10,"Summe:","Teiler"]
[1,null,null,null,null,null,null,null,null,null,null,null,{"$f":"IF(SUM(C38:L38)=0,\"\",SUM(C38:L38))","v":""},0]
[2,null,null,null,null,null,null,null,null,null,null,null,{"$f":"IF(SUM(C39:L39)=0,\"\",SUM(C39:L39))","v":""},0]
[3,null,null,null,null,null,null,null,null,null,null,null,{"$f":"IF(SUM(C40:L40)=0,\"\",SUM(C40:L40))","v":""},0]
[4,null,null,null,null,null,null,null,null,null,null,null,{"$f":"IF(SUM(C41:L41)=0,\"\",SUM(C41:L41))","v":""},0]
[5,null,null,null,null,null,null,null,null,null,null,null,{"$f":"IF(SUM(C42:L42)=0,\"\",SUM(C42:L42))","v":""},0]
[null,"Bester Einzelschütze/in:",{"$f":"IF(ISERROR(P36),\"\",LOOKUP(2,1/(M38:M42&\"*\"&N38:N42=O36&\"*\"&P36),B38:B42))","v":""},null,null,null,{"$f":"IF(SUM(M38:M42)=0,\"\",O36)","v":""},"Ringe",null,null,"gesamt:",null,{"$f":"IF(SUM(M38:M42)=0,\"\",SUM(M38:M42))","v":""},{"$f":"MIN(N38:N42)","v":0}]
[]
["Jugend",null,null,null,null,null,null,null,null,null,null,null,null,null,{"$f":"MAX(M47:M51)","v":0},{"$f":"INDEX(N47:N51,MATCH(O45&MIN(IF(M47:M51=O45,N47:N51)),M47:M51&N47:N51,0))","v":{"$error":"#N/A"}}]
[null,"Name:",1,2,3,4,5,6,7,8,9,10,"Summe:","Teiler"]
[1,null,null,null,null,null,null,null,null,null,null,null,{"$f":"IF(SUM(C47:L47)=0,\"\",SUM(C47:L47))","v":""},0]
[2,null,null,null,null,null,null,null,null,null,null,null,{"$f":"IF(SUM(C48:L48)=0,\"\",SUM(C48:L48))","v":""},0]
[3,null,null,null,null,null,null,null,null,null,null,null,{"$f":"IF(SUM(C49:L49)=0,\"\",SUM(C49:L49))","v":""},0]
[4,null,null,null,null,null,null,null,null,null,null,null,{"$f":"IF(SUM(C50:L50)=0,\"\",SUM(C50:L50))","v":""},0]
[5,null,null,null,null,null,null,null,null,null,null,null,{"$f":"IF(SUM(C51:L51)=0,\"\",SUM(C51:L51))","v":""},0]
[null,"Bester Einzelschütze/in:",{"$f":"IF(ISERROR(P45),\"\",LOOKUP(2,1/(M47:M51&\"*\"&N47:N51=O45&\"*\"&P45),B47:B51))","v":""},null,null,null,{"$f":"IF(SUM(M47:M51)=0,\"\",O45)","v":""},"Ringe",null,null,"gesamt:",null,{"$f":"IF(SUM(M47:M51)=0,\"\",SUM(M47:M51))","v":""},{"$f":"MIN(N47:N51)","v":0}]
[]
["Name des Königs:",null,"Teiler"]
[]
["Name der Königin:",null,"Teiler"]

{"sheet":"Soderstorf","index":6,"n_rows":56,"n_cols":16,"rows_kept":56,"cut":false,"hidden":false,"merged":[[17,0,17,13],[33,7,33,8],[42,2,42,5],[42,7,42,8],[35,0,35,13],[42,10,42,11],[33,10,33,11],[26,0,26,13],[24,2,24,5],[24,7,24,8],[24,10,24,11],[33,2,33,5],[0,0,0,12],[1,10,1,11],[15,10,15,11],[15,2,15,5],[15,7,15,8],[3,0,3,13],[1,2,1,5],[56,0,56,1],[53,2,53,3],[54,2,54,3],[55,2,55,3],[56,2,56,3],[44,0,44,13],[53,0,53,1],[54,0,54,1],[55,0,55,1],[51,2,51,5],[51,7,51,8],[51,10,51,11]]}
[{"$f":"\"Vier Vereineschießen in\"&\" \"&Preisteilnehmer!$B$5","v":"Vier Vereineschießen in ???"}]
[null,"Verein:","Soderstorf",null,null,null,null,null,null,null,"Datum:",null,{"$f":"Preisteilnehmer!$B$6","v":"XX.XX.20XX"},null,{"$f":"MAX(M6:M15)","v":0},{"$f":"INDEX(N6:N15,MATCH(O2&MIN(IF(M6:M15=O2,N6:N15)),M6:M15&N6:N15,0))","v":{"$error":"#N/A"}}]
[]
["Schützen Standauflage"]
[null,"Name:",1,2,3,4,5,6,7,8,9,10,"Summe:","Teiler"]
[1,null,null,null,null,null,null,null,null,null,null,null,{"$f":"IF(SUM(C6:L6)=0,\"\",SUM(C6:L6))","v":""}]
[2,null,null,null,null,null,null,null,null,null,null,null,""]
[3,null,null,null,null,null,null,null,null,null,null,null,""]
[4,null,null,null,null,null,null,null,null,null,null,null,""]
[5,null,null,null,null,null,null,null,null,null,null,null,""]
[6,null,null,null,null,null,null,null,null,null,null,null,""]
[7,null,null,null,null,null,null,null,null,null,null,null,""]
[8,null,null,null,null,null,null,null,null,null,null,null,""]
[9,null,null,null,null,null,null,null,null,null,null,null,""]
[10,null,null,null,null,null,null,null,null,null,null,null,""]
[null,"Bester Einzelschütze/in:",{"$f":"IF(ISERROR(P2),\"\",LOOKUP(2,1/(M6:M15&\"*\"&N6:N15=O2&\"*\"&P2),B6:B15))","v":""},null,null,null,{"$f":"IF(ISERROR(P2),\"\",O2)","v":""},"Ringe",null,null,"gesamt:",null,{"$f":"IF(SUM(M6:M15)=0,\"\",SUM(M6:M15))","v":""},{"$f":"MIN(N6:N15)","v":0}]
[]
["Damen",null,null,null,null,null,null,null,null,null,null,null,null,null,{"$f":"MAX(M20:M24)","v":0},{"$f":"INDEX(N20:N24,MATCH(O18&MIN(IF(M20:M24=O18,N20:N24)),M20:M24&N20:N24,0))","v":{"$error":"#N/A"}}]
[null,"Name:",1,2,3,4,5,6,7,8,9,10,"Summe:","Teiler"]
[1,null,null,null,null,null,null,null,null,null,null,null,{"$f":"IF(SUM(C20:L20)=0,\"\",SUM(C20:L20))","v":""}]
[2,null,null,null,null,null,null,null,null,null,null,null,{"$f":"IF(SUM(C21:L21)=0,\"\",SUM(C21:L21))","v":""}]
[3,null,null,null,null,null,null,null,null,null,null,null,{"$f":"IF(SUM(C22:L22)=0,\"\",SUM(C22:L22))","v":""}]
[4,null,null,null,null,null,null,null,null,null,null,null,{"$f":"IF(SUM(C23:L23)=0,\"\",SUM(C23:L23))","v":""}]
[5,null,null,null,null,null,null,null,null,null,null,null,{"$f":"IF(SUM(C24:L24)=0,\"\",SUM(C24:L24))","v":""}]
[null,"Bester Einzelschütze/in:",{"$f":"IF(ISERROR(P18),\"\",LOOKUP(2,1/(M20:M24&\"*\"&N20:N24=O18&\"*\"&P18),B20:B24))","v":""},null,null,null,{"$f":"IF(ISERROR(P18),\"\",O18)","v":""},"Ringe",null,null,"gesamt:",null,{"$f":"IF(SUM(M20:M24)=0,\"\",SUM(M20:M24))","v":""},{"$f":"MIN(N20:N24)","v":0}]
[]
["Altersklasse Auflage",null,null,null,null,null,null,null,null,null,null,null,null,null,{"$f":"MAX(M29:M33)","v":0},{"$f":"INDEX(N29:N33,MATCH(O27&MIN(IF(M29:M33=O27,N29:N33)),M29:M33&N29:N33,0))","v":{"$error":"#N/A"}}]
[null,"Name:",1,2,3,4,5,6,7,8,9,10,"Summe:","Teiler"]
[1,null,null,null,null,null,null,null,null,null,null,null,{"$f":"IF(SUM(C29:L29)=0,\"\",SUM(C29:L29))","v":""}]
[2,null,null,null,null,null,null,null,null,null,null,null,{"$f":"IF(SUM(C30:L30)=0,\"\",SUM(C30:L30))","v":""}]
[3,null,null,null,null,null,null,null,null,null,null,null,{"$f":"IF(SUM(C31:L31)=0,\"\",SUM(C31:L31))","v":""}]
[4,null,null,null,null,null,null,null,null,null,null,null,{"$f":"IF(SUM(C32:L32)=0,\"\",SUM(C32:L32))","v":""}]
[5,null,null,null,null,null,null,null,null,null,null,null,{"$f":"IF(SUM(C33:L33)=0,\"\",SUM(C33:L33))","v":""}]
[null,"Beste Einzelschützin:",{"$f":"IF(ISERROR(P27),\"\",LOOKUP(2,1/(M29:M33&\"*\"&N29:N33=O27&\"*\"&P27),B29:B33))","v":""},null,null,null,{"$f":"IF(ISERROR(P27),\"\",O27)","v":""},"Ringe",null,null,"gesamt:",null,{"$f":"IF(SUM(M29:M33)=0,\"\",SUM(M29:M33))","v":""},{"$f":"MIN(N29:N33)","v":0}]
[]
["Freihand",null,null,null,null,null,null,null,null,null,null,null,null,null,{"$f":"MAX(M38:M42)","v":0},{"$f":"INDEX(N38:N42,MATCH(O36&MIN(IF(M38:M42=O36,N38:N42)),M38:M42&N38:N42,0))","v":{"$error":"#N/A"}}]
[null,"Name:",1,2,3,4,5,6,7,8,9,10,"Summe:","Teiler"]
[1,null,null,null,null,null,null,null,null,null,null,null,{"$f":"IF(SUM(C38:L38)=0,\"\",SUM(C38:L38))","v":""},0]
[2,null,null,null,null,null,null,null,null,null,null,null,{"$f":"IF(SUM(C39:L39)=0,\"\",SUM(C39:L39))","v":""},0]
[3,null,null,null,null,null,null,null,null,null,null,null,{"$f":"IF(SUM(C40:L40)=0,\"\",SUM(C40:L40))","v":""},0]
[4,null,null,null,null,null,null,null,null,null,null,null,{"$f":"IF(SUM(C41:L41)=0,\"\",SUM(C41:L41))","v":""},0]
[5,null,null,null,null,null,null,null,null,null,null,null,{"$f":"IF(SUM(C42:L42)=0,\"\",SUM(C42:L42))","v":""},0]
[null,"Bester Einzelschütze/in:",{"$f":"IF(ISERROR(P36),\"\",LOOKUP(2,1/(M38:M42&\"*\"&N38:N42=O36&\"*\"&P36),B38:B42))","v":""},null,null,null,{"$f":"IF(SUM(M38:M42)=0,\"\",O36)","v":""},"Ringe",null,null,"gesamt:",null,{"$f":"IF(SUM(M38:M42)=0,\"\",SUM(M38:M42))","v":""},{"$f":"MIN(N38:N42)","v":0}]
[]
["Jugend",null,null,null,null,null,null,null,null,null,null,null,null,null,{"$f":"MAX(M47:M51)","v":0},{"$f":"INDEX(N47:N51,MATCH(O45&MIN(IF(M47:M51=O45,N47:N51)),M47:M51&N47:N51,0))","v":{"$error":"#N/A"}}]
[null,"Name:",1,2,3,4,5,6,7,8,9,10,"Summe:","Teiler"]
[1,null,null,null,null,null,null,null,null,null,null,null,{"$f":"IF(SUM(C47:L47)=0,\"\",SUM(C47:L47))","v":""},0]
[2,null,null,null,null,null,null,null,null,null,null,null,{"$f":"IF(SUM(C48:L48)=0,\"\",SUM(C48:L48))","v":""},0]
[3,null,null,null,null,null,null,null,null,null,null,null,{"$f":"IF(SUM(C49:L49)=0,\"\",SUM(C49:L49))","v":""},0]
[4,null,null,null,null,null,null,null,null,null,null,null,{"$f":"IF(SUM(C50:L50)=0,\"\",SUM(C50:L50))","v":""},0]
[5,null,null,null,null,null,null,null,null,null,null,null,{"$f":"IF(SUM(C51:L51)=0,\"\",SUM(C51:L51))","v":""},0]
[null,"Bester Einzelschütze/in:",{"$f":"IF(ISERROR(P45),\"\",LOOKUP(2,1/(M47:M51&\"*\"&N47:N51=O45&\"*\"&P45),B47:B51))","v":""},null,null,null,{"$f":"IF(SUM(M47:M51)=0,\"\",O45)","v":""},"Ringe",null,null,"gesamt:",null,{"$f":"IF(SUM(M47:M51)=0,\"\",SUM(M47:M51))","v":""},{"$f":"MIN(N47:N51)","v":0}]
[]
["Name des Königs:",null,"Teiler"]
[]
["Name der Königin:",null,"Teiler"]

{"sheet":"Wetzen","index":7,"n_rows":56,"n_cols":16,"rows_kept":56,"cut":false,"hidden":false,"merged":[[51,10,51,11],[44,0,44,13],[51,2,51,5],[33,2,33,5],[33,7,33,8],[42,2,42,5],[42,7,42,8],[51,7,51,8],[42,10,42,11],[0,0,0,12],[1,10,1,11],[15,10,15,11],[15,2,15,5],[15,7,15,8],[3,0,3,13],[17,0,17,13],[26,0,26,13],[35,0,35,13],[1,2,1,5],[33,10,33,11],[24,2,24,5],[24,7,24,8],[24,10,24,11],[53,0,53,1],[54,0,54,1],[55,0,55,1],[56,0,56,1],[53,2,53,3],[54,2,54,3],[55,2,55,3],[56,2,56,3]]}
[{"$f":"\"Vier Vereineschießen in\"&\" \"&Preisteilnehmer!$B$5","v":"Vier Vereineschießen in ???"}]
[null,"Verein:","Wetzen",null,null,null,null,null,null,null,"Datum:",null,{"$f":"Preisteilnehmer!$B$6","v":"XX.XX.20XX"},null,{"$f":"MAX(M6:M15)","v":0},{"$f":"INDEX(N6:N15,MATCH(O2&MIN(IF(M6:M15=O2,N6:N15)),M6:M15&N6:N15,0))","v":{"$error":"#N/A"}}]
[]
["Schützen Standauflage"]
[null,"Name:",1,2,3,4,5,6,7,8,9,10,"Summe:","Teiler"]
[1,null,null,null,null,null,null,null,null,null,null,null,{"$f":"IF(SUM(C6:L6)=0,\"\",SUM(C6:L6))","v":""}]
[2,null,null,null,null,null,null,null,null,null,null,null,""]
[3,null,null,null,null,null,null,null,null,null,null,null,""]
[4,null,null,null,null,null,null,null,null,null,null,null,""]
[5,null,null,null,null,null,null,null,null,null,null,null,""]
[6,null,null,null,null,null,null,null,null,null,null,null,""]
[7,null,null,null,null,null,null,null,null,null,null,null,""]
[8,null,null,null,null,null,null,null,null,null,null,null,""]
[9,null,null,null,null,null,null,null,null,null,null,null,""]
[10,null,null,null,null,null,null,null,null,null,null,null,""]
[null,"Bester Einzelschütze/in:",{"$f":"IF(ISERROR(P2),\"\",LOOKUP(2,1/(M6:M15&\"*\"&N6:N15=O2&\"*\"&P2),B6:B15))","v":""},null,null,null,{"$f":"IF(ISERROR(P2),\"\",O2)","v":""},"Ringe",null,null,"gesamt:",null,{"$f":"IF(SUM(M6:M15)=0,\"\",SUM(M6:M15))","v":""},{"$f":"MIN(N6:N15)","v":0}]
[]
["Damen",null,null,null,null,null,null,null,null,null,null,null,null,null,{"$f":"MAX(M20:M24)","v":0},{"$f":"INDEX(N20:N24,MATCH(O18&MIN(IF(M20:M24=O18,N20:N24)),M20:M24&N20:N24,0))","v":{"$error":"#N/A"}}]
[null,"Name:",1,2,3,4,5,6,7,8,9,10,"Summe:","Teiler"]
[1,null,null,null,null,null,null,null,null,null,null,null,{"$f":"IF(SUM(C20:L20)=0,\"\",SUM(C20:L20))","v":""}]
[2,null,null,null,null,null,null,null,null,null,null,null,{"$f":"IF(SUM(C21:L21)=0,\"\",SUM(C21:L21))","v":""}]
[3,null,null,null,null,null,null,null,null,null,null,null,{"$f":"IF(SUM(C22:L22)=0,\"\",SUM(C22:L22))","v":""}]
[4,null,null,null,null,null,null,null,null,null,null,null,{"$f":"IF(SUM(C23:L23)=0,\"\",SUM(C23:L23))","v":""}]
[5,null,null,null,null,null,null,null,null,null,null,null,{"$f":"IF(SUM(C24:L24)=0,\"\",SUM(C24:L24))","v":""}]
[null,"Bester Einzelschütze/in:",{"$f":"IF(ISERROR(P18),\"\",LOOKUP(2,1/(M20:M24&\"*\"&N20:N24=O18&\"*\"&P18),B20:B24))","v":""},null,null,null,{"$f":"IF(ISERROR(P18),\"\",O18)","v":""},"Ringe",null,null,"gesamt:",null,{"$f":"IF(SUM(M20:M24)=0,\"\",SUM(M20:M24))","v":""},{"$f":"MIN(N20:N24)","v":0}]
[]
["Altersklasse Auflage",null,null,null,null,null,null,null,null,null,null,null,null,null,{"$f":"MAX(M29:M33)","v":0},{"$f":"INDEX(N29:N33,MATCH(O27&MIN(IF(M29:M33=O27,N29:N33)),M29:M33&N29:N33,0))","v":{"$error":"#N/A"}}]
[null,"Name:",1,2,3,4,5,6,7,8,9,10,"Summe:","Teiler"]
[1,null,null,null,null,null,null,null,null,null,null,null,{"$f":"IF(SUM(C29:L29)=0,\"\",SUM(C29:L29))","v":""}]
[2,null,null,null,null,null,null,null,null,null,null,null,{"$f":"IF(SUM(C30:L30)=0,\"\",SUM(C30:L30))","v":""}]
[3,null,null,null,null,null,null,null,null,null,null,null,{"$f":"IF(SUM(C31:L31)=0,\"\",SUM(C31:L31))","v":""}]
[4,null,null,null,null,null,null,null,null,null,null,null,{"$f":"IF(SUM(C32:L32)=0,\"\",SUM(C32:L32))","v":""}]
[5,null,null,null,null,null,null,null,null,null,null,null,{"$f":"IF(SUM(C33:L33)=0,\"\",SUM(C33:L33))","v":""}]
[null,"Beste Einzelschützin:",{"$f":"IF(ISERROR(P27),\"\",LOOKUP(2,1/(M29:M33&\"*\"&N29:N33=O27&\"*\"&P27),B29:B33))","v":""},null,null,null,{"$f":"IF(ISERROR(P27),\"\",O27)","v":""},"Ringe",null,null,"gesamt:",null,{"$f":"IF(SUM(M29:M33)=0,\"\",SUM(M29:M33))","v":""},{"$f":"MIN(N29:N33)","v":0}]
[]
["Freihand",null,null,null,null,null,null,null,null,null,null,null,null,null,{"$f":"MAX(M38:M42)","v":0},{"$f":"INDEX(N38:N42,MATCH(O36&MIN(IF(M38:M42=O36,N38:N42)),M38:M42&N38:N42,0))","v":{"$error":"#N/A"}}]
[null,"Name:",1,2,3,4,5,6,7,8,9,10,"Summe:","Teiler"]
[1,null,null,null,null,null,null,null,null,null,null,null,{"$f":"IF(SUM(C38:L38)=0,\"\",SUM(C38:L38))","v":""},0]
[2,null,null,null,null,null,null,null,null,null,null,null,{"$f":"IF(SUM(C39:L39)=0,\"\",SUM(C39:L39))","v":""},0]
[3,null,null,null,null,null,null,null,null,null,null,null,{"$f":"IF(SUM(C40:L40)=0,\"\",SUM(C40:L40))","v":""},0]
[4,null,null,null,null,null,null,null,null,null,null,null,{"$f":"IF(SUM(C41:L41)=0,\"\",SUM(C41:L41))","v":""},0]
[5,null,null,null,null,null,null,null,null,null,null,null,{"$f":"IF(SUM(C42:L42)=0,\"\",SUM(C42:L42))","v":""},0]
[null,"Bester Einzelschütze/in:",{"$f":"IF(ISERROR(P36),\"\",LOOKUP(2,1/(M38:M42&\"*\"&N38:N42=O36&\"*\"&P36),B38:B42))","v":""},null,null,null,{"$f":"IF(SUM(M38:M42)=0,\"\",O36)","v":""},"Ringe",null,null,"gesamt:",null,{"$f":"IF(SUM(M38:M42)=0,\"\",SUM(M38:M42))","v":""},{"$f":"MIN(N38:N42)","v":0}]
[]
["Jugend",null,null,null,null,null,null,null,null,null,null,null,null,null,{"$f":"MAX(M47:M51)","v":0},{"$f":"INDEX(N47:N51,MATCH(O45&MIN(IF(M47:M51=O45,N47:N51)),M47:M51&N47:N51,0))","v":{"$error":"#N/A"}}]
[null,"Name:",1,2,3,4,5,6,7,8,9,10,"Summe:","Teiler"]
[1,null,null,null,null,null,null,null,null,null,null,null,{"$f":"IF(SUM(C47:L47)=0,\"\",SUM(C47:L47))","v":""},0]
[2,null,null,null,null,null,null,null,null,null,null,null,{"$f":"IF(SUM(C48:L48)=0,\"\",SUM(C48:L48))","v":""},0]
[3,null,null,null,null,null,null,null,null,null,null,null,{"$f":"IF(SUM(C49:L49)=0,\"\",SUM(C49:L49))","v":""},0]
[4,null,null,null,null,null,null,null,null,null,null,null,{"$f":"IF(SUM(C50:L50)=0,\"\",SUM(C50:L50))","v":""},0]
[5,null,null,null,null,null,null,null,null,null,null,null,{"$f":"IF(SUM(C51:L51)=0,\"\",SUM(C51:L51))","v":""},0]
[null,"Bester Einzelschütze/in:",{"$f":"IF(ISERROR(P45),\"\",LOOKUP(2,1/(M47:M51&\"*\"&N47:N51=O45&\"*\"&P45),B47:B51))","v":""},null,null,null,{"$f":"IF(SUM(M47:M51)=0,\"\",O45)","v":""},"Ringe",null,null,"gesamt:",null,{"$f":"IF(SUM(M47:M51)=0,\"\",SUM(M47:M51))","v":""},{"$f":"MIN(N47:N51)","v":0}]
[]
["Name des Königs:",null,"Teiler"]
[]
["Name der Königin:",null,"Teiler"]

{"sheet":"Sammler","index":8,"n_rows":101,"n_cols":18,"rows_kept":101,"cut":false,"hidden":false,"merged":[]}
["Ergebnisse pro Disziplin:",null,"Schützen Standauflage",null,"Bester Einzelschütze:",null,null,null,null,null,null,null,null,null,"Preisschießen"]
["Verein:","Ringe:","Teiler:",null,"Platz:","Verein:","Name:","Ringe:","Teiler:",null,"Königsschießen","Name:","Teiler",null,{"$f":"Teilereingabe!D3","v":"Start\nNummer:"},{"$f":"Teilereingabe!E3","v":"Name:"},{"$f":"Teilereingabe!F3","v":"Verein:"},{"$f":"Teilereingabe!G3","v":"Teiler:"}]
[{"$f":"IF(B3=0,\"Soderstorf keine Teilnahme\",\"Soderstorf\")","v":"Soderstorf keine Teilnahme"},{"$f":"IF(Soderstorf!$M$16=\"\",0,Soderstorf!$M$16)","v":0},{"$f":"Soderstorf!N16","v":0},null,"1.",{"$f":"IF(G3=\"\",\"\",\"Soderstorf\")","v":""},{"$f":"Soderstorf!$C$16","v":""},{"$f":"IF(Soderstorf!$G$16=\"\",0,Soderstorf!$G$16)","v":0},{"$f":"IF(ISERROR(Soderstorf!P2),\"\",Soderstorf!P2)","v":""},null,{"$f":"IF(L3=\"\",\"\",\"Soderstorf\")","v":""},{"$f":"IF(Soderstorf!$A$55=\"\",\"\",Soderstorf!$A$55)","v":""},{"$f":"IF(L3=\"\",\"\",Soderstorf!$C$55)","v":""},null,{"$f":"IF(Teilereingabe!D4=\"\",\"\",Teilereingabe!D4)","v":""},{"$f":"IF(Teilereingabe!E4=\"\",\"\",Teilereingabe!E4)","v":""},{"$f":"IF(Teilereingabe!F4=\"\",\"\",Teilereingabe!F4)","v":""},{"$f":"IF(Teilereingabe!G4=\"\",\"\",Teilereingabe!G4)","v":""}]
[{"$f":"IF(B4=0,\"Wetzen keine Teilnahme\",\"Wetzen\")","v":"Wetzen keine Teilnahme"},{"$f":"IF(Wetzen!$M$16=\"\",0,Wetzen!$M$16)","v":0},{"$f":"Wetzen!N16","v":0},null,"2.",{"$f":"IF(G4=\"\",\"\",\"Wetzen\")","v":""},{"$f":"Wetzen!$C$16","v":""},{"$f":"IF(Wetzen!$G$16=\"\",0,Wetzen!$G$16)","v":0},{"$f":"IF(ISERROR(Wetzen!P2),\"\",Wetzen!P2)","v":""},null,{"$f":"IF(L4=\"\",\"\",\"Wetzen\")","v":""},{"$f":"IF(Wetzen!$A$55=\"\",\"\",Wetzen!$A$55)","v":""},{"$f":"IF(L4=\"\",\"\",Wetzen!$C$55)","v":""},null,{"$f":"IF(Teilereingabe!D5=\"\",\"\",Teilereingabe!D5)","v":""},{"$f":"IF(Teilereingabe!E5=\"\",\"\",Teilereingabe!E5)","v":""},{"$f":"IF(Teilereingabe!F5=\"\",\"\",Teilereingabe!F5)","v":""},{"$f":"IF(Teilereingabe!G5=\"\",\"\",Teilereingabe!G5)","v":""}]
[{"$f":"IF(B5=0,\"Eyendorf keine Teilnahme\",\"Eyendorf\")","v":"Eyendorf keine Teilnahme"},{"$f":"IF(Eyendorf!$M$16=\"\",0,Eyendorf!$M$16)","v":0},{"$f":"Eyendorf!N16","v":0},null,"3.",{"$f":"IF(G5=\"\",\"\",\"Eyendorf\")","v":""},{"$f":"Eyendorf!$C$16","v":""},{"$f":"IF(Eyendorf!$G$16=\"\",0,Eyendorf!$G$16)","v":0},{"$f":"IF(ISERROR(Eyendorf!P2),\"\",Eyendorf!P2)","v":""},null,{"$f":"IF(L5=\"\",\"\",\"Eyendorf\")","v":""},{"$f":"IF(Eyendorf!$A$55=\"\",\"\",Eyendorf!$A$55)","v":""},{"$f":"IF(L5=\"\",\"\",Eyendorf!$C$55)","v":""},null,{"$f":"IF(Teilereingabe!D6=\"\",\"\",Teilereingabe!D6)","v":""},{"$f":"IF(Teilereingabe!E6=\"\",\"\",Teilereingabe!E6)","v":""},{"$f":"IF(Teilereingabe!F6=\"\",\"\",Teilereingabe!F6)","v":""},{"$f":"IF(Teilereingabe!G6=\"\",\"\",Teilereingabe!G6)","v":""}]
[{"$f":"IF(B6=0,\"Raven-Rolfsen keine Teilnahme\",\"Raven-Rolfsen\")","v":"Raven-Rolfsen keine Teilnahme"},{"$f":"IF('Raven-Rolfsen'!$M$16=\"\",0,'Raven-Rolfsen'!$M$16)","v":0},{"$f":"'Raven-Rolfsen'!N16","v":0},null,"4.",{"$f":"IF(G6=\"\",\"\",\"Raven-Rolfsen\")","v":""},{"$f":"'Raven-Rolfsen'!$C$16","v":""},{"$f":"IF('Raven-Rolfsen'!$G$16=\"\",0,'Raven-Rolfsen'!$G$16)","v":0},{"$f":"IF(ISERROR('Raven-Rolfsen'!P2),\"\",'Raven-Rolfsen'!P2)","v":""},null,{"$f":"IF(L6=\"\",\"\",\"Raven-Rolfsen\")","v":""},{"$f":"IF('Raven-Rolfsen'!$A$55=\"\",\"\",'Raven-Rolfsen'!$A$55)","v":""},{"$f":"IF(L6=\"\",\"\",'Raven-Rolfsen'!$C$55)","v":""},null,{"$f":"IF(Teilereingabe!D7=\"\",\"\",Teilereingabe!D7)","v":""},{"$f":"IF(Teilereingabe!E7=\"\",\"\",Teilereingabe!E7)","v":""},{"$f":"IF(Teilereingabe!F7=\"\",\"\",Teilereingabe!F7)","v":""},{"$f":"IF(Teilereingabe!G7=\"\",\"\",Teilereingabe!G7)","v":""}]
[null,null,null,null,null,null,null,null,null,null,null,null,null,null,{"$f":"IF(Teilereingabe!D8=\"\",\"\",Teilereingabe!D8)","v":""},{"$f":"IF(Teilereingabe!E8=\"\",\"\",Teilereingabe!E8)","v":""},{"$f":"IF(Teilereingabe!F8=\"\",\"\",Teilereingabe!F8)","v":""},{"$f":"IF(Teilereingabe!G8=\"\",\"\",Teilereingabe!G8)","v":""}]
[null,null,"Damen",null,null,null,null,null,null,null,null,null,null,null,{"$f":"IF(Teilereingabe!D9=\"\",\"\",Teilereingabe!D9)","v":""},{"$f":"IF(Teilereingabe!E9=\"\",\"\",Teilereingabe!E9)","v":""},{"$f":"IF(Teilereingabe!F9=\"\",\"\",Teilereingabe!F9)","v":""},{"$f":"IF(Teilereingabe!G9=\"\",\"\",Teilereingabe!G9)","v":""}]
[{"$f":"IF(B9=0,\"Soderstorf keine Teilnahme\",\"Soderstorf\")","v":"Soderstorf keine Teilnahme"},{"$f":"IF(Soderstorf!$M$25=\"\",0,Soderstorf!$M$25)","v":0},{"$f":"Soderstorf!N25","v":0},null,"1.",{"$f":"IF(G9=\"\",\"\",\"Soderstorf\")","v":""},{"$f":"Soderstorf!$C$25","v":""},{"$f":"IF(Soderstorf!$G$25=\"\",0,Soderstorf!$G$25)","v":0},{"$f":"IF(ISERROR(Soderstorf!P18),\"\",Soderstorf!P18)","v":""},null,"Königinenschießen","Name:","Teiler",null,{"$f":"IF(Teilereingabe!D10=\"\",\"\",Teilereingabe!D10)","v":""},{"$f":"IF(Teilereingabe!E10=\"\",\"\",Teilereingabe!E10)","v":""},{"$f":"IF(Teilereingabe!F10=\"\",\"\",Teilereingabe!F10)","v":""},{"$f":"IF(Teilereingabe!G10=\"\",\"\",Teilereingabe!G10)","v":""}]
[{"$f":"IF(B10=0,\"Wetzen keine Teilnahme\",\"Wetzen\")","v":"Wetzen keine Teilnahme"},{"$f":"IF(Wetzen!$M$25=\"\",0,Wetzen!$M$25)","v":0},{"$f":"Wetzen!N25","v":0},null,"2.",{"$f":"IF(G10=\"\",\"\",\"Wetzen\")","v":""},{"$f":"Wetzen!$C$25","v":""},{"$f":"IF(Wetzen!$G$25=\"\",0,Wetzen!$G$25)","v":0},{"$f":"IF(ISERROR(Wetzen!P18),\"\",Wetzen!P18)","v":""},null,{"$f":"IF(L10=\"\",\"\",\"Soderstorf\")","v":""},{"$f":"IF(Soderstorf!$A$57=\"\",\"\",Soderstorf!$A$57)","v":""},{"$f":"IF(L10=\"\",\"\",Soderstorf!$C$57)","v":""},null,{"$f":"IF(Teilereingabe!D11=\"\",\"\",Teilereingabe!D11)","v":""},{"$f":"IF(Teilereingabe!E11=\"\",\"\",Teilereingabe!E11)","v":""},{"$f":"IF(Teilereingabe!F11=\"\",\"\",Teilereingabe!F11)","v":""},{"$f":"IF(Teilereingabe!G11=\"\",\"\",Teilereingabe!G11)","v":""}]
[{"$f":"IF(B11=0,\"Eyendorf keine Teilnahme\",\"Eyendorf\")","v":"Eyendorf keine Teilnahme"},{"$f":"IF(Eyendorf!$M$25=\"\",0,Eyendorf!$M$25)","v":0},{"$f":"Eyendorf!N25","v":0},null,"3.",{"$f":"IF(G11=\"\",\"\",\"Eyendorf\")","v":""},{"$f":"Eyendorf!$C$25","v":""},{"$f":"IF(Eyendorf!$G$25=\"\",0,Eyendorf!$G$25)","v":0},{"$f":"IF(ISERROR(Eyendorf!P18),\"\",Eyendorf!P18)","v":""},null,{"$f":"IF(L11=\"\",\"\",\"Wetzen\")","v":""},{"$f":"IF(Wetzen!$A$57=\"\",\"\",Wetzen!$A$57)","v":""},{"$f":"IF(L11=\"\",\"\",Wetzen!$C$57)","v":""},null,{"$f":"IF(Teilereingabe!D12=\"\",\"\",Teilereingabe!D12)","v":""},{"$f":"IF(Teilereingabe!E12=\"\",\"\",Teilereingabe!E12)","v":""},{"$f":"IF(Teilereingabe!F12=\"\",\"\",Teilereingabe!F12)","v":""},{"$f":"IF(Teilereingabe!G12=\"\",\"\",Teilereingabe!G12)","v":""}]
[{"$f":"IF(B12=0,\"Raven-Rolfsen keine Teilnahme\",\"Raven-Rolfsen\")","v":"Raven-Rolfsen keine Teilnahme"},{"$f":"IF('Raven-Rolfsen'!$M$25=\"\",0,'Raven-Rolfsen'!$M$25)","v":0},{"$f":"'Raven-Rolfsen'!N25","v":0},null,"4.",{"$f":"IF(G12=\"\",\"\",\"Raven-Rolfsen\")","v":""},{"$f":"'Raven-Rolfsen'!$C$25","v":""},{"$f":"IF('Raven-Rolfsen'!$G$25=\"\",0,'Raven-Rolfsen'!$G$25)","v":0},{"$f":"IF(ISERROR('Raven-Rolfsen'!P18),\"\",'Raven-Rolfsen'!P18)","v":""},null,{"$f":"IF(L12=\"\",\"\",\"Eyendorf\")","v":""},{"$f":"IF(Eyendorf!$A$57=\"\",\"\",Eyendorf!$A$57)","v":""},{"$f":"IF(L12=\"\",\"\",Eyendorf!$C$57)","v":""},null,{"$f":"IF(Teilereingabe!D13=\"\",\"\",Teilereingabe!D13)","v":""},{"$f":"IF(Teilereingabe!E13=\"\",\"\",Teilereingabe!E13)","v":""},{"$f":"IF(Teilereingabe!F13=\"\",\"\",Teilereingabe!F13)","v":""},{"$f":"IF(Teilereingabe!G13=\"\",\"\",Teilereingabe!G13)","v":""}]
[null,null,null,null,null,null,null,null,null,null,{"$f":"IF(L13=\"\",\"\",\"Raven-Rolfsen\")","v":""},{"$f":"IF('Raven-Rolfsen'!$A$57=\"\",\"\",'Raven-Rolfsen'!$A$57)","v":""},{"$f":"IF(L13=\"\",\"\",'Raven-Rolfsen'!$C$57)","v":""},null,{"$f":"IF(Teilereingabe!D14=\"\",\"\",Teilereingabe!D14)","v":""},{"$f":"IF(Teilereingabe!E14=\"\",\"\",Teilereingabe!E14)","v":""},{"$f":"IF(Teilereingabe!F14=\"\",\"\",Teilereingabe!F14)","v":""},{"$f":"IF(Teilereingabe!G14=\"\",\"\",Teilereingabe!G14)","v":""}]
[null,null,"Altersklasse Auflage",null,null,null,null,null,null,null,null,null,null,null,{"$f":"IF(Teilereingabe!D15=\"\",\"\",Teilereingabe!D15)","v":""},{"$f":"IF(Teilereingabe!E15=\"\",\"\",Teilereingabe!E15)","v":""},{"$f":"IF(Teilereingabe!F15=\"\",\"\",Teilereingabe!F15)","v":""},{"$f":"IF(Teilereingabe!G15=\"\",\"\",Teilereingabe!G15)","v":""}]
[{"$f":"IF(B15=0,\"Soderstorf keine Teilnahme\",\"Soderstorf\")","v":"Soderstorf keine Teilnahme"},{"$f":"IF(Soderstorf!$M$34=\"\",0,Soderstorf!$M$34)","v":0},{"$f":"Soderstorf!N34","v":0},null,"1.",{"$f":"IF(G15=\"\",\"\",\"Soderstorf\")","v":""},{"$f":"Soderstorf!$C$34","v":""},{"$f":"IF(Soderstorf!$G$34=\"\",0,Soderstorf!$G$34)","v":0},{"$f":"IF(ISERROR(Soderstorf!P27),\"\",Soderstorf!P27)","v":""},null,null,null,null,null,{"$f":"IF(Teilereingabe!D16=\"\",\"\",Teilereingabe!D16)","v":""},{"$f":"IF(Teilereingabe!E16=\"\",\"\",Teilereingabe!E16)","v":""},{"$f":"IF(Teilereingabe!F16=\"\",\"\",Teilereingabe!F16)","v":""},{"$f":"IF(Teilereingabe!G16=\"\",\"\",Teilereingabe!G16)","v":""}]
[{"$f":"IF(B16=0,\"Wetzen keine Teilnahme\",\"Wetzen\")","v":"Wetzen keine Teilnahme"},{"$f":"IF(Wetzen!$M$34=\"\",0,Wetzen!$M$34)","v":0},{"$f":"Wetzen!N34","v":0},null,"2.",{"$f":"IF(G16=\"\",\"\",\"Wetzen\")","v":""},{"$f":"Wetzen!$C$34","v":""},{"$f":"IF(Wetzen!$G$34=\"\",0,Wetzen!$G$34)","v":0},{"$f":"IF(ISERROR(Wetzen!P27),\"\",Wetzen!P27)","v":""},null,null,null,null,null,{"$f":"IF(Teilereingabe!D17=\"\",\"\",Teilereingabe!D17)","v":""},{"$f":"IF(Teilereingabe!E17=\"\",\"\",Teilereingabe!E17)","v":""},{"$f":"IF(Teilereingabe!F17=\"\",\"\",Teilereingabe!F17)","v":""},{"$f":"IF(Teilereingabe!G17=\"\",\"\",Teilereingabe!G17)","v":""}]
[{"$f":"IF(B17=0,\"Eyendorf keine Teilnahme\",\"Eyendorf\")","v":"Eyendorf keine Teilnahme"},{"$f":"IF(Eyendorf!$M$34=\"\",0,Eyendorf!$M$34)","v":0},{"$f":"Eyendorf!N34","v":0},null,"3.",{"$f":"IF(G17=\"\",\"\",\"Eyendorf\")","v":""},{"$f":"Eyendorf!$C$34","v":""},{"$f":"IF(Eyendorf!$G$34=\"\",0,Eyendorf!$G$34)","v":0},{"$f":"IF(ISERROR(Eyendorf!P27),\"\",Eyendorf!P27)","v":""},null,null,null,null,null,{"$f":"IF(Teilereingabe!D18=\"\",\"\",Teilereingabe!D18)","v":""},{"$f":"IF(Teilereingabe!E18=\"\",\"\",Teilereingabe!E18)","v":""},{"$f":"IF(Teilereingabe!F18=\"\",\"\",Teilereingabe!F18)","v":""},{"$f":"IF(Teilereingabe!G18=\"\",\"\",Teilereingabe!G18)","v":""}]
[{"$f":"IF(B18=0,\"Raven-Rolfsen keine Teilnahme\",\"Raven-Rolfsen\")","v":"Raven-Rolfsen keine Teilnahme"},{"$f":"IF('Raven-Rolfsen'!$M$34=\"\",0,'Raven-Rolfsen'!$M$34)","v":0},{"$f":"'Raven-Rolfsen'!N34","v":0},null,"4.",{"$f":"IF(G18=\"\",\"\",\"Raven-Rolfsen\")","v":""},{"$f":"'Raven-Rolfsen'!$C$34","v":""},{"$f":"IF('Raven-Rolfsen'!$G$34=\"\",0,'Raven-Rolfsen'!$G$34)","v":0},{"$f":"IF(ISERROR('Raven-Rolfsen'!P27),\"\",'Raven-Rolfsen'!P27)","v":""},null,null,null,null,null,{"$f":"IF(Teilereingabe!D19=\"\",\"\",Teilereingabe!D19)","v":""},{"$f":"IF(Teilereingabe!E19=\"\",\"\",Teilereingabe!E19)","v":""},{"$f":"IF(Teilereingabe!F19=\"\",\"\",Teilereingabe!F19)","v":""},{"$f":"IF(Teilereingabe!G19=\"\",\"\",Teilereingabe!G19)","v":""}]
[null,null,null,null,null,null,null,null,null,null,null,null,null,null,{"$f":"IF(Teilereingabe!D20=\"\",\"\",Teilereingabe!D20)","v":""},{"$f":"IF(Teilereingabe!E20=\"\",\"\",Teilereingabe!E20)","v":""},{"$f":"IF(Teilereingabe!F20=\"\",\"\",Teilereingabe!F20)","v":""},{"$f":"IF(Teilereingabe!G20=\"\",\"\",Teilereingabe!G20)","v":""}]
[null,null,"Freihand",null,null,null,null,null,null,null,null,null,null,null,{"$f":"IF(Teilereingabe!D21=\"\",\"\",Teilereingabe!D21)","v":""},{"$f":"IF(Teilereingabe!E21=\"\",\"\",Teilereingabe!E21)","v":""},{"$f":"IF(Teilereingabe!F21=\"\",\"\",Teilereingabe!F21)","v":""},{"$f":"IF(Teilereingabe!G21=\"\",\"\",Teilereingabe!G21)","v":""}]
[{"$f":"IF(B21=0,\"Soderstorf keine Teilnahme\",\"Soderstorf\")","v":"Soderstorf keine Teilnahme"},{"$f":"IF(Soderstorf!$M$43=\"\",0,Soderstorf!$M$43)","v":0},{"$f":"Soderstorf!$N$43","v":0},null,"1.",{"$f":"IF(G21=\"\",\"\",\"Soderstorf\")","v":""},{"$f":"Soderstorf!$C$43","v":""},{"$f":"IF(Soderstorf!$G$43=\"\",0,Soderstorf!$G$43)","v":0},{"$f":"IF(ISERROR(Soderstorf!P36),\"\",Soderstorf!P36)","v":""},null,null,null,null,null,{"$f":"IF(Teilereingabe!D22=\"\",\"\",Teilereingabe!D22)","v":""},{"$f":"IF(Teilereingabe!E22=\"\",\"\",Teilereingabe!E22)","v":""},{"$f":"IF(Teilereingabe!F22=\"\",\"\",Teilereingabe!F22)","v":""},{"$f":"IF(Teilereingabe!G22=\"\",\"\",Teilereingabe!G22)","v":""}]
[{"$f":"IF(B22=0,\"Wetzen keine Teilnahme\",\"Wetzen\")","v":"Wetzen keine Teilnahme"},{"$f":"IF(Wetzen!$M$43=\"\",0,Wetzen!$M$43)","v":0},{"$f":"Wetzen!N43","v":0},null,"2.",{"$f":"IF(G22=\"\",\"\",\"Wetzen\")","v":""},{"$f":"Wetzen!$C$43","v":""},{"$f":"IF(Wetzen!$G$43=\"\",0,Wetzen!$G$43)","v":0},{"$f":"IF(ISERROR(Wetzen!P36),\"\",Wetzen!P36)","v":""},null,null,null,null,null,{"$f":"IF(Teilereingabe!D23=\"\",\"\",Teilereingabe!D23)","v":""},{"$f":"IF(Teilereingabe!E23=\"\",\"\",Teilereingabe!E23)","v":""},{"$f":"IF(Teilereingabe!F23=\"\",\"\",Teilereingabe!F23)","v":""},{"$f":"IF(Teilereingabe!G23=\"\",\"\",Teilereingabe!G23)","v":""}]
[{"$f":"IF(B23=0,\"Eyendorf keine Teilnahme\",\"Eyendorf\")","v":"Eyendorf keine Teilnahme"},{"$f":"IF(Eyendorf!$M$43=\"\",0,Eyendorf!$M$43)","v":0},{"$f":"Eyendorf!N43","v":0},null,"3.",{"$f":"IF(G23=\"\",\"\",\"Eyendorf\")","v":""},{"$f":"Eyendorf!$C$43","v":""},{"$f":"IF(Eyendorf!$G$43=\"\",0,Eyendorf!$G$43)","v":0},{"$f":"IF(ISERROR(Eyendorf!P36),\"\",Eyendorf!P36)","v":""},null,null,null,null,null,{"$f":"IF(Teilereingabe!D24=\"\",\"\",Teilereingabe!D24)","v":""},{"$f":"IF(Teilereingabe!E24=\"\",\"\",Teilereingabe!E24)","v":""},{"$f":"IF(Teilereingabe!F24=\"\",\"\",Teilereingabe!F24)","v":""},{"$f":"IF(Teilereingabe!G24=\"\",\"\",Teilereingabe!G24)","v":""}]
[{"$f":"IF(B24=0,\"Raven-Rolfsen keine Teilnahme\",\"Raven-Rolfsen\")","v":"Raven-Rolfsen keine Teilnahme"},{"$f":"IF('Raven-Rolfsen'!$M$43=\"\",0,'Raven-Rolfsen'!$M$43)","v":0},{"$f":"'Raven-Rolfsen'!N43","v":0},null,"4.",{"$f":"IF(G24=\"\",\"\",\"Raven-Rolfsen\")","v":""},{"$f":"'Raven-Rolfsen'!$C$43","v":""},{"$f":"IF('Raven-Rolfsen'!$G$43=\"\",0,'Raven-Rolfsen'!$G$43)","v":0},{"$f":"IF(ISERROR('Raven-Rolfsen'!P36),\"\",'Raven-Rolfsen'!P36)","v":""},null,null,null,null,null,{"$f":"IF(Teilereingabe!D25=\"\",\"\",Teilereingabe!D25)","v":""},{"$f":"IF(Teilereingabe!E25=\"\",\"\",Teilereingabe!E25)","v":""},{"$f":"IF(Teilereingabe!F25=\"\",\"\",Teilereingabe!F25)","v":""},{"$f":"IF(Teilereingabe!G25=\"\",\"\",Teilereingabe!G25)","v":""}]
[null,null,null,null,null,null,null,null,null,null,null,null,null,null,{"$f":"IF(Teilereingabe!D26=\"\",\"\",Teilereingabe!D26)","v":""},{"$f":"IF(Teilereingabe!E26=\"\",\"\",Teilereingabe!E26)","v":""},{"$f":"IF(Teilereingabe!F26=\"\",\"\",Teilereingabe!F26)","v":""},{"$f":"IF(Teilereingabe!G26=\"\",\"\",Teilereingabe!G26)","v":""}]
[null,null,"Jugend",null,null,null,null,null,null,null,null,null,null,null,{"$f":"IF(Teilereingabe!D27=\"\",\"\",Teilereingabe!D27)","v":""},{"$f":"IF(Teilereingabe!E27=\"\",\"\",Teilereingabe!E27)","v":""},{"$f":"IF(Teilereingabe!F27=\"\",\"\",Teilereingabe!F27)","v":""},{"$f":"IF(Teilereingabe!G27=\"\",\"\",Teilereingabe!G27)","v":""}]
[{"$f":"IF(B27=0,\"Soderstorf keine Teilnahme\",\"Soderstorf\")","v":"Soderstorf keine Teilnahme"},{"$f":"IF(Soderstorf!$M$52=\"\",0,Soderstorf!$M$52)","v":0},{"$f":"Soderstorf!N52","v":0},null,"1.",{"$f":"IF(G27=\"\",\"\",\"Soderstorf\")","v":""},{"$f":"Soderstorf!$C$52","v":""},{"$f":"IF(Soderstorf!$G$52=\"\",0,Soderstorf!$G$52)","v":0},{"$f":"IF(ISERROR(Soderstorf!P45),\"\",Soderstorf!P45)","v":""},null,null,null,null,null,{"$f":"IF(Teilereingabe!D28=\"\",\"\",Teilereingabe!D28)","v":""},{"$f":"IF(Teilereingabe!E28=\"\",\"\",Teilereingabe!E28)","v":""},{"$f":"IF(Teilereingabe!F28=\"\",\"\",Teilereingabe!F28)","v":""},{"$f":"IF(Teilereingabe!G28=\"\",\"\",Teilereingabe!G28)","v":""}]
[{"$f":"IF(B28=0,\"Wetzen keine Teilnahme\",\"Wetzen\")","v":"Wetzen keine Teilnahme"},{"$f":"IF(Wetzen!$M$52=\"\",0,Wetzen!$M$52)","v":0},{"$f":"Wetzen!N52","v":0},null,"2.",{"$f":"IF(G28=\"\",\"\",\"Wetzen\")","v":""},{"$f":"Wetzen!$C$52","v":""},{"$f":"IF(Wetzen!$G$52=\"\",0,Wetzen!$G$52)","v":0},{"$f":"IF(ISERROR(Wetzen!P45),\"\",Wetzen!P45)","v":""},null,null,null,null,null,{"$f":"IF(Teilereingabe!D29=\"\",\"\",Teilereingabe!D29)","v":""},{"$f":"IF(Teilereingabe!E29=\"\",\"\",Teilereingabe!E29)","v":""},{"$f":"IF(Teilereingabe!F29=\"\",\"\",Teilereingabe!F29)","v":""},{"$f":"IF(Teilereingabe!G29=\"\",\"\",Teilereingabe!G29)","v":""}]
[{"$f":"IF(B29=0,\"Eyendorf keine Teilnahme\",\"Eyendorf\")","v":"Eyendorf keine Teilnahme"},{"$f":"IF(Eyendorf!$M$52=\"\",0,Eyendorf!$M$52)","v":0},{"$f":"Eyendorf!N52","v":0},null,"3.",{"$f":"IF(G29=\"\",\"\",\"Eyendorf\")","v":""},{"$f":"Eyendorf!$C$52","v":""},{"$f":"IF(Eyendorf!$G$52=\"\",0,Eyendorf!$G$52)","v":0},{"$f":"IF(ISERROR(Eyendorf!P45),\"\",Eyendorf!P45)","v":""},null,null,null,null,null,{"$f":"IF(Teilereingabe!D30=\"\",\"\",Teilereingabe!D30)","v":""},{"$f":"IF(Teilereingabe!E30=\"\",\"\",Teilereingabe!E30)","v":""},{"$f":"IF(Teilereingabe!F30=\"\",\"\",Teilereingabe!F30)","v":""},{"$f":"IF(Teilereingabe!G30=\"\",\"\",Teilereingabe!G30)","v":""}]
[{"$f":"IF(B30=0,\"Raven-Rolfsen keine Teilnahme\",\"Raven-Rolfsen\")","v":"Raven-Rolfsen keine Teilnahme"},{"$f":"IF('Raven-Rolfsen'!$M$52=\"\",0,'Raven-Rolfsen'!$M$52)","v":0},{"$f":"'Raven-Rolfsen'!N52","v":0},null,"4.",{"$f":"IF(G30=\"\",\"\",\"Raven-Rolfsen\")","v":""},{"$f":"'Raven-Rolfsen'!$C$52","v":""},{"$f":"IF('Raven-Rolfsen'!$G$52=\"\",0,'Raven-Rolfsen'!$G$52)","v":0},{"$f":"IF(ISERROR('Raven-Rolfsen'!P45),\"\",'Raven-Rolfsen'!P45)","v":""},null,null,null,null,null,{"$f":"IF(Teilereingabe!D31=\"\",\"\",Teilereingabe!D31)","v":""},{"$f":"IF(Teilereingabe!E31=\"\",\"\",Teilereingabe!E31)","v":""},{"$f":"IF(Teilereingabe!F31=\"\",\"\",Teilereingabe!F31)","v":""},{"$f":"IF(Teilereingabe!G31=\"\",\"\",Teilereingabe!G31)","v":""}]
[null,null,null,null,null,null,null,null,null,null,null,null,null,null,{"$f":"IF(Teilereingabe!D32=\"\",\"\",Teilereingabe!D32)","v":""},{"$f":"IF(Teilereingabe!E32=\"\",\"\",Teilereingabe!E32)","v":""},{"$f":"IF(Teilereingabe!F32=\"\",\"\",Teilereingabe!F32)","v":""},{"$f":"IF(Teilereingabe!G32=\"\",\"\",Teilereingabe!G32)","v":""}]
[null,null,null,null,null,null,null,null,null,null,null,null,null,null,{"$f":"IF(Teilereingabe!D33=\"\",\"\",Teilereingabe!D33)","v":""},{"$f":"IF(Teilereingabe!E33=\"\",\"\",Teilereingabe!E33)","v":""},{"$f":"IF(Teilereingabe!F33=\"\",\"\",Teilereingabe!F33)","v":""},{"$f":"IF(Teilereingabe!G33=\"\",\"\",Teilereingabe!G33)","v":""}]
[null,null,null,null,null,null,null,null,null,null,null,null,null,null,{"$f":"IF(Teilereingabe!D34=\"\",\"\",Teilereingabe!D34)","v":""},{"$f":"IF(Teilereingabe!E34=\"\",\"\",Teilereingabe!E34)","v":""},{"$f":"IF(Teilereingabe!F34=\"\",\"\",Teilereingabe!F34)","v":""},{"$f":"IF(Teilereingabe!G34=\"\",\"\",Teilereingabe!G34)","v":""}]
[null,null,null,null,null,null,null,null,null,null,null,null,null,null,{"$f":"IF(Teilereingabe!D35=\"\",\"\",Teilereingabe!D35)","v":""},{"$f":"IF(Teilereingabe!E35=\"\",\"\",Teilereingabe!E35)","v":""},{"$f":"IF(Teilereingabe!F35=\"\",\"\",Teilereingabe!F35)","v":""},{"$f":"IF(Teilereingabe!G35=\"\",\"\",Teilereingabe!G35)","v":""}]
[null,null,null,null,null,null,null,null,null,null,null,null,null,null,{"$f":"IF(Teilereingabe!D36=\"\",\"\",Teilereingabe!D36)","v":""},{"$f":"IF(Teilereingabe!E36=\"\",\"\",Teilereingabe!E36)","v":""},{"$f":"IF(Teilereingabe!F36=\"\",\"\",Teilereingabe!F36)","v":""},{"$f":"IF(Teilereingabe!G36=\"\",\"\",Teilereingabe!G36)","v":""}]
[null,null,null,null,null,null,null,null,null,null,null,null,null,null,{"$f":"IF(Teilereingabe!D37=\"\",\"\",Teilereingabe!D37)","v":""},{"$f":"IF(Teilereingabe!E37=\"\",\"\",Teilereingabe!E37)","v":""},{"$f":"IF(Teilereingabe!F37=\"\",\"\",Teilereingabe!F37)","v":""},{"$f":"IF(Teilereingabe!G37=\"\",\"\",Teilereingabe!G37)","v":""}]
[null,null,null,null,null,null,null,null,null,null,null,null,null,null,{"$f":"IF(Teilereingabe!D38=\"\",\"\",Teilereingabe!D38)","v":""},{"$f":"IF(Teilereingabe!E38=\"\",\"\",Teilereingabe!E38)","v":""},{"$f":"IF(Teilereingabe!F38=\"\",\"\",Teilereingabe!F38)","v":""},{"$f":"IF(Teilereingabe!G38=\"\",\"\",Teilereingabe!G38)","v":""}]
[null,null,null,null,null,null,null,null,null,null,null,null,null,null,{"$f":"IF(Teilereingabe!D39=\"\",\"\",Teilereingabe!D39)","v":""},{"$f":"IF(Teilereingabe!E39=\"\",\"\",Teilereingabe!E39)","v":""},{"$f":"IF(Teilereingabe!F39=\"\",\"\",Teilereingabe!F39)","v":""},{"$f":"IF(Teilereingabe!G39=\"\",\"\",Teilereingabe!G39)","v":""}]
[null,null,null,null,null,null,null,null,null,null,null,null,null,null,{"$f":"IF(Teilereingabe!D40=\"\",\"\",Teilereingabe!D40)","v":""},{"$f":"IF(Teilereingabe!E40=\"\",\"\",Teilereingabe!E40)","v":""},{"$f":"IF(Teilereingabe!F40=\"\",\"\",Teilereingabe!F40)","v":""},{"$f":"IF(Teilereingabe!G40=\"\",\"\",Teilereingabe!G40)","v":""}]
[null,null,null,null,null,null,null,null,null,null,null,null,null,null,{"$f":"IF(Teilereingabe!D41=\"\",\"\",Teilereingabe!D41)","v":""},{"$f":"IF(Teilereingabe!E41=\"\",\"\",Teilereingabe!E41)","v":""},{"$f":"IF(Teilereingabe!F41=\"\",\"\",Teilereingabe!F41)","v":""},{"$f":"IF(Teilereingabe!G41=\"\",\"\",Teilereingabe!G41)","v":""}]
[null,null,null,null,null,null,null,null,null,null,null,null,null,null,{"$f":"IF(Teilereingabe!D42=\"\",\"\",Teilereingabe!D42)","v":""},{"$f":"IF(Teilereingabe!E42=\"\",\"\",Teilereingabe!E42)","v":""},{"$f":"IF(Teilereingabe!F42=\"\",\"\",Teilereingabe!F42)","v":""},{"$f":"IF(Teilereingabe!G42=\"\",\"\",Teilereingabe!G42)","v":""}]
[null,null,null,null,null,null,null,null,null,null,null,null,null,null,{"$f":"IF(Teilereingabe!D43=\"\",\"\",Teilereingabe!D43)","v":""},{"$f":"IF(Teilereingabe!E43=\"\",\"\",Teilereingabe!E43)","v":""},{"$f":"IF(Teilereingabe!F43=\"\",\"\",Teilereingabe!F43)","v":""},{"$f":"IF(Teilereingabe!G43=\"\",\"\",Teilereingabe!G43)","v":""}]
[null,null,null,null,null,null,null,null,null,null,null,null,null,null,{"$f":"IF(Teilereingabe!D44=\"\",\"\",Teilereingabe!D44)","v":""},{"$f":"IF(Teilereingabe!E44=\"\",\"\",Teilereingabe!E44)","v":""},{"$f":"IF(Teilereingabe!F44=\"\",\"\",Teilereingabe!F44)","v":""},{"$f":"IF(Teilereingabe!G44=\"\",\"\",Teilereingabe!G44)","v":""}]
[null,null,null,null,null,null,null,null,null,null,null,null,null,null,{"$f":"IF(Teilereingabe!D45=\"\",\"\",Teilereingabe!D45)","v":""},{"$f":"IF(Teilereingabe!E45=\"\",\"\",Teilereingabe!E45)","v":""},{"$f":"IF(Teilereingabe!F45=\"\",\"\",Teilereingabe!F45)","v":""},{"$f":"IF(Teilereingabe!G45=\"\",\"\",Teilereingabe!G45)","v":""}]
[null,null,null,null,null,null,null,null,null,null,null,null,null,null,{"$f":"IF(Teilereingabe!D46=\"\",\"\",Teilereingabe!D46)","v":""},{"$f":"IF(Teilereingabe!E46=\"\",\"\",Teilereingabe!E46)","v":""},{"$f":"IF(Teilereingabe!F46=\"\",\"\",Teilereingabe!F46)","v":""},{"$f":"IF(Teilereingabe!G46=\"\",\"\",Teilereingabe!G46)","v":""}]
[null,null,null,null,null,null,null,null,null,null,null,null,null,null,{"$f":"IF(Teilereingabe!D47=\"\",\"\",Teilereingabe!D47)","v":""},{"$f":"IF(Teilereingabe!E47=\"\",\"\",Teilereingabe!E47)","v":""},{"$f":"IF(Teilereingabe!F47=\"\",\"\",Teilereingabe!F47)","v":""},{"$f":"IF(Teilereingabe!G47=\"\",\"\",Teilereingabe!G47)","v":""}]
[null,null,null,null,null,null,null,null,null,null,null,null,null,null,{"$f":"IF(Teilereingabe!D48=\"\",\"\",Teilereingabe!D48)","v":""},{"$f":"IF(Teilereingabe!E48=\"\",\"\",Teilereingabe!E48)","v":""},{"$f":"IF(Teilereingabe!F48=\"\",\"\",Teilereingabe!F48)","v":""},{"$f":"IF(Teilereingabe!G48=\"\",\"\",Teilereingabe!G48)","v":""}]
[null,null,null,null,null,null,null,null,null,null,null,null,null,null,{"$f":"IF(Teilereingabe!D49=\"\",\"\",Teilereingabe!D49)","v":""},{"$f":"IF(Teilereingabe!E49=\"\",\"\",Teilereingabe!E49)","v":""},{"$f":"IF(Teilereingabe!F49=\"\",\"\",Teilereingabe!F49)","v":""},{"$f":"IF(Teilereingabe!G49=\"\",\"\",Teilereingabe!G49)","v":""}]
[null,null,null,null,null,null,null,null,null,null,null,null,null,null,{"$f":"IF(Teilereingabe!D50=\"\",\"\",Teilereingabe!D50)","v":""},{"$f":"IF(Teilereingabe!E50=\"\",\"\",Teilereingabe!E50)","v":""},{"$f":"IF(Teilereingabe!F50=\"\",\"\",Teilereingabe!F50)","v":""},{"$f":"IF(Teilereingabe!G50=\"\",\"\",Teilereingabe!G50)","v":""}]
[null,null,null,null,null,null,null,null,null,null,null,null,null,null,{"$f":"IF(Teilereingabe!D51=\"\",\"\",Teilereingabe!D51)","v":""},{"$f":"IF(Teilereingabe!E51=\"\",\"\",Teilereingabe!E51)","v":""},{"$f":"IF(Teilereingabe!F51=\"\",\"\",Teilereingabe!F51)","v":""},{"$f":"IF(Teilereingabe!G51=\"\",\"\",Teilereingabe!G51)","v":""}]
[null,null,null,null,null,null,null,null,null,null,null,null,null,null,{"$f":"IF(Teilereingabe!D52=\"\",\"\",Teilereingabe!D52)","v":""},{"$f":"IF(Teilereingabe!E52=\"\",\"\",Teilereingabe!E52)","v":""},{"$f":"IF(Teilereingabe!F52=\"\",\"\",Teilereingabe!F52)","v":""},{"$f":"IF(Teilereingabe!G52=\"\",\"\",Teilereingabe!G52)","v":""}]
[null,null,null,null,null,null,null,null,null,null,null,null,null,null,{"$f":"IF(Teilereingabe!D53=\"\",\"\",Teilereingabe!D53)","v":""},{"$f":"IF(Teilereingabe!E53=\"\",\"\",Teilereingabe!E53)","v":""},{"$f":"IF(Teilereingabe!F53=\"\",\"\",Teilereingabe!F53)","v":""},{"$f":"IF(Teilereingabe!G53=\"\",\"\",Teilereingabe!G53)","v":""}]
[null,null,null,null,null,null,null,null,null,null,null,null,null,null,{"$f":"IF(Teilereingabe!D54=\"\",\"\",Teilereingabe!D54)","v":""},{"$f":"IF(Teilereingabe!E54=\"\",\"\",Teilereingabe!E54)","v":""},{"$f":"IF(Teilereingabe!F54=\"\",\"\",Teilereingabe!F54)","v":""},{"$f":"IF(Teilereingabe!G54=\"\",\"\",Teilereingabe!G54)","v":""}]
[null,null,null,null,null,null,null,null,null,null,null,null,null,null,{"$f":"IF(Teilereingabe!D55=\"\",\"\",Teilereingabe!D55)","v":""},{"$f":"IF(Teilereingabe!E55=\"\",\"\",Teilereingabe!E55)","v":""},{"$f":"IF(Teilereingabe!F55=\"\",\"\",Teilereingabe!F55)","v":""},{"$f":"IF(Teilereingabe!G55=\"\",\"\",Teilereingabe!G55)","v":""}]
[null,null,null,null,null,null,null,null,null,null,null,null,null,null,{"$f":"IF(Teilereingabe!D56=\"\",\"\",Teilereingabe!D56)","v":""},{"$f":"IF(Teilereingabe!E56=\"\",\"\",Teilereingabe!E56)","v":""},{"$f":"IF(Teilereingabe!F56=\"\",\"\",Teilereingabe!F56)","v":""},{"$f":"IF(Teilereingabe!G56=\"\",\"\",Teilereingabe!G56)","v":""}]
[null,null,null,null,null,null,null,null,null,null,null,null,null,null,{"$f":"IF(Teilereingabe!D57=\"\",\"\",Teilereingabe!D57)","v":""},{"$f":"IF(Teilereingabe!E57=\"\",\"\",Teilereingabe!E57)","v":""},{"$f":"IF(Teilereingabe!F57=\"\",\"\",Teilereingabe!F57)","v":""},{"$f":"IF(Teilereingabe!G57=\"\",\"\",Teilereingabe!G57)","v":""}]
[null,null,null,null,null,null,null,null,null,null,null,null,null,null,{"$f":"IF(Teilereingabe!D58=\"\",\"\",Teilereingabe!D58)","v":""},{"$f":"IF(Teilereingabe!E58=\"\",\"\",Teilereingabe!E58)","v":""},{"$f":"IF(Teilereingabe!F58=\"\",\"\",Teilereingabe!F58)","v":""},{"$f":"IF(Teilereingabe!G58=\"\",\"\",Teilereingabe!G58)","v":""}]
[null,null,null,null,null,null,null,null,null,null,null,null,null,null,{"$f":"IF(Teilereingabe!D59=\"\",\"\",Teilereingabe!D59)","v":""},{"$f":"IF(Teilereingabe!E59=\"\",\"\",Teilereingabe!E59)","v":""},{"$f":"IF(Teilereingabe!F59=\"\",\"\",Teilereingabe!F59)","v":""},{"$f":"IF(Teilereingabe!G59=\"\",\"\",Teilereingabe!G59)","v":""}]
[null,null,null,null,null,null,null,null,null,null,null,null,null,null,{"$f":"IF(Teilereingabe!D60=\"\",\"\",Teilereingabe!D60)","v":""},{"$f":"IF(Teilereingabe!E60=\"\",\"\",Teilereingabe!E60)","v":""},{"$f":"IF(Teilereingabe!F60=\"\",\"\",Teilereingabe!F60)","v":""},{"$f":"IF(Teilereingabe!G60=\"\",\"\",Teilereingabe!G60)","v":""}]
[null,null,null,null,null,null,null,null,null,null,null,null,null,null,{"$f":"IF(Teilereingabe!D61=\"\",\"\",Teilereingabe!D61)","v":""},{"$f":"IF(Teilereingabe!E61=\"\",\"\",Teilereingabe!E61)","v":""},{"$f":"IF(Teilereingabe!F61=\"\",\"\",Teilereingabe!F61)","v":""},{"$f":"IF(Teilereingabe!G61=\"\",\"\",Teilereingabe!G61)","v":""}]
[null,null,null,null,null,null,null,null,null,null,null,null,null,null,{"$f":"IF(Teilereingabe!D62=\"\",\"\",Teilereingabe!D62)","v":""},{"$f":"IF(Teilereingabe!E62=\"\",\"\",Teilereingabe!E62)","v":""},{"$f":"IF(Teilereingabe!F62=\"\",\"\",Teilereingabe!F62)","v":""},{"$f":"IF(Teilereingabe!G62=\"\",\"\",Teilereingabe!G62)","v":""}]
[null,null,null,null,null,null,null,null,null,null,null,null,null,null,{"$f":"IF(Teilereingabe!D63=\"\",\"\",Teilereingabe!D63)","v":""},{"$f":"IF(Teilereingabe!E63=\"\",\"\",Teilereingabe!E63)","v":""},{"$f":"IF(Teilereingabe!F63=\"\",\"\",Teilereingabe!F63)","v":""},{"$f":"IF(Teilereingabe!G63=\"\",\"\",Teilereingabe!G63)","v":""}]
[null,null,null,null,null,null,null,null,null,null,null,null,null,null,{"$f":"IF(Teilereingabe!D64=\"\",\"\",Teilereingabe!D64)","v":""},{"$f":"IF(Teilereingabe!E64=\"\",\"\",Teilereingabe!E64)","v":""},{"$f":"IF(Teilereingabe!F64=\"\",\"\",Teilereingabe!F64)","v":""},{"$f":"IF(Teilereingabe!G64=\"\",\"\",Teilereingabe!G64)","v":""}]
[null,null,null,null,null,null,null,null,null,null,null,null,null,null,{"$f":"IF(Teilereingabe!D65=\"\",\"\",Teilereingabe!D65)","v":""},{"$f":"IF(Teilereingabe!E65=\"\",\"\",Teilereingabe!E65)","v":""},{"$f":"IF(Teilereingabe!F65=\"\",\"\",Teilereingabe!F65)","v":""},{"$f":"IF(Teilereingabe!G65=\"\",\"\",Teilereingabe!G65)","v":""}]
[null,null,null,null,null,null,null,null,null,null,null,null,null,null,{"$f":"IF(Teilereingabe!D66=\"\",\"\",Teilereingabe!D66)","v":""},{"$f":"IF(Teilereingabe!E66=\"\",\"\",Teilereingabe!E66)","v":""},{"$f":"IF(Teilereingabe!F66=\"\",\"\",Teilereingabe!F66)","v":""},{"$f":"IF(Teilereingabe!G66=\"\",\"\",Teilereingabe!G66)","v":""}]
[null,null,null,null,null,null,null,null,null,null,null,null,null,null,{"$f":"IF(Teilereingabe!D67=\"\",\"\",Teilereingabe!D67)","v":""},{"$f":"IF(Teilereingabe!E67=\"\",\"\",Teilereingabe!E67)","v":""},{"$f":"IF(Teilereingabe!F67=\"\",\"\",Teilereingabe!F67)","v":""},{"$f":"IF(Teilereingabe!G67=\"\",\"\",Teilereingabe!G67)","v":""}]
[null,null,null,null,null,null,null,null,null,null,null,null,null,null,{"$f":"IF(Teilereingabe!D68=\"\",\"\",Teilereingabe!D68)","v":""},{"$f":"IF(Teilereingabe!E68=\"\",\"\",Teilereingabe!E68)","v":""},{"$f":"IF(Teilereingabe!F68=\"\",\"\",Teilereingabe!F68)","v":""},{"$f":"IF(Teilereingabe!G68=\"\",\"\",Teilereingabe!G68)","v":""}]
[null,null,null,null,null,null,null,null,null,null,null,null,null,null,{"$f":"IF(Teilereingabe!D69=\"\",\"\",Teilereingabe!D69)","v":""},{"$f":"IF(Teilereingabe!E69=\"\",\"\",Teilereingabe!E69)","v":""},{"$f":"IF(Teilereingabe!F69=\"\",\"\",Teilereingabe!F69)","v":""},{"$f":"IF(Teilereingabe!G69=\"\",\"\",Teilereingabe!G69)","v":""}]
[null,null,null,null,null,null,null,null,null,null,null,null,null,null,{"$f":"IF(Teilereingabe!D70=\"\",\"\",Teilereingabe!D70)","v":""},{"$f":"IF(Teilereingabe!E70=\"\",\"\",Teilereingabe!E70)","v":""},{"$f":"IF(Teilereingabe!F70=\"\",\"\",Teilereingabe!F70)","v":""},{"$f":"IF(Teilereingabe!G70=\"\",\"\",Teilereingabe!G70)","v":""}]
[null,null,null,null,null,null,null,null,null,null,null,null,null,null,{"$f":"IF(Teilereingabe!D71=\"\",\"\",Teilereingabe!D71)","v":""},{"$f":"IF(Teilereingabe!E71=\"\",\"\",Teilereingabe!E71)","v":""},{"$f":"IF(Teilereingabe!F71=\"\",\"\",Teilereingabe!F71)","v":""},{"$f":"IF(Teilereingabe!G71=\"\",\"\",Teilereingabe!G71)","v":""}]
[null,null,null,null,null,null,null,null,null,null,null,null,null,null,{"$f":"IF(Teilereingabe!D72=\"\",\"\",Teilereingabe!D72)","v":""},{"$f":"IF(Teilereingabe!E72=\"\",\"\",Teilereingabe!E72)","v":""},{"$f":"IF(Teilereingabe!F72=\"\",\"\",Teilereingabe!F72)","v":""},{"$f":"IF(Teilereingabe!G72=\"\",\"\",Teilereingabe!G72)","v":""}]
[null,null,null,null,null,null,null,null,null,null,null,null,null,null,{"$f":"IF(Teilereingabe!D73=\"\",\"\",Teilereingabe!D73)","v":""},{"$f":"IF(Teilereingabe!E73=\"\",\"\",Teilereingabe!E73)","v":""},{"$f":"IF(Teilereingabe!F73=\"\",\"\",Teilereingabe!F73)","v":""},{"$f":"IF(Teilereingabe!G73=\"\",\"\",Teilereingabe!G73)","v":""}]
[null,null,null,null,null,null,null,null,null,null,null,null,null,null,{"$f":"IF(Teilereingabe!D74=\"\",\"\",Teilereingabe!D74)","v":""},{"$f":"IF(Teilereingabe!E74=\"\",\"\",Teilereingabe!E74)","v":""},{"$f":"IF(Teilereingabe!F74=\"\",\"\",Teilereingabe!F74)","v":""},{"$f":"IF(Teilereingabe!G74=\"\",\"\",Teilereingabe!G74)","v":""}]
[null,null,null,null,null,null,null,null,null,null,null,null,null,null,{"$f":"IF(Teilereingabe!D75=\"\",\"\",Teilereingabe!D75)","v":""},{"$f":"IF(Teilereingabe!E75=\"\",\"\",Teilereingabe!E75)","v":""},{"$f":"IF(Teilereingabe!F75=\"\",\"\",Teilereingabe!F75)","v":""},{"$f":"IF(Teilereingabe!G75=\"\",\"\",Teilereingabe!G75)","v":""}]
[null,null,null,null,null,null,null,null,null,null,null,null,null,null,{"$f":"IF(Teilereingabe!D76=\"\",\"\",Teilereingabe!D76)","v":""},{"$f":"IF(Teilereingabe!E76=\"\",\"\",Teilereingabe!E76)","v":""},{"$f":"IF(Teilereingabe!F76=\"\",\"\",Teilereingabe!F76)","v":""},{"$f":"IF(Teilereingabe!G76=\"\",\"\",Teilereingabe!G76)","v":""}]
[null,null,null,null,null,null,null,null,null,null,null,null,null,null,{"$f":"IF(Teilereingabe!D77=\"\",\"\",Teilereingabe!D77)","v":""},{"$f":"IF(Teilereingabe!E77=\"\",\"\",Teilereingabe!E77)","v":""},{"$f":"IF(Teilereingabe!F77=\"\",\"\",Teilereingabe!F77)","v":""},{"$f":"IF(Teilereingabe!G77=\"\",\"\",Teilereingabe!G77)","v":""}]
[null,null,null,null,null,null,null,null,null,null,null,null,null,null,{"$f":"IF(Teilereingabe!D78=\"\",\"\",Teilereingabe!D78)","v":""},{"$f":"IF(Teilereingabe!E78=\"\",\"\",Teilereingabe!E78)","v":""},{"$f":"IF(Teilereingabe!F78=\"\",\"\",Teilereingabe!F78)","v":""},{"$f":"IF(Teilereingabe!G78=\"\",\"\",Teilereingabe!G78)","v":""}]
[null,null,null,null,null,null,null,null,null,null,null,null,null,null,{"$f":"IF(Teilereingabe!D79=\"\",\"\",Teilereingabe!D79)","v":""},{"$f":"IF(Teilereingabe!E79=\"\",\"\",Teilereingabe!E79)","v":""},{"$f":"IF(Teilereingabe!F79=\"\",\"\",Teilereingabe!F79)","v":""},{"$f":"IF(Teilereingabe!G79=\"\",\"\",Teilereingabe!G79)","v":""}]
[null,null,null,null,null,null,null,null,null,null,null,null,null,null,{"$f":"IF(Teilereingabe!D80=\"\",\"\",Teilereingabe!D80)","v":""},{"$f":"IF(Teilereingabe!E80=\"\",\"\",Teilereingabe!E80)","v":""},{"$f":"IF(Teilereingabe!F80=\"\",\"\",Teilereingabe!F80)","v":""},{"$f":"IF(Teilereingabe!G80=\"\",\"\",Teilereingabe!G80)","v":""}]
[null,null,null,null,null,null,null,null,null,null,null,null,null,null,{"$f":"IF(Teilereingabe!D81=\"\",\"\",Teilereingabe!D81)","v":""},{"$f":"IF(Teilereingabe!E81=\"\",\"\",Teilereingabe!E81)","v":""},{"$f":"IF(Teilereingabe!F81=\"\",\"\",Teilereingabe!F81)","v":""},{"$f":"IF(Teilereingabe!G81=\"\",\"\",Teilereingabe!G81)","v":""}]
[null,null,null,null,null,null,null,null,null,null,null,null,null,null,{"$f":"IF(Teilereingabe!D82=\"\",\"\",Teilereingabe!D82)","v":""},{"$f":"IF(Teilereingabe!E82=\"\",\"\",Teilereingabe!E82)","v":""},{"$f":"IF(Teilereingabe!F82=\"\",\"\",Teilereingabe!F82)","v":""},{"$f":"IF(Teilereingabe!G82=\"\",\"\",Teilereingabe!G82)","v":""}]
[null,null,null,null,null,null,null,null,null,null,null,null,null,null,{"$f":"IF(Teilereingabe!D83=\"\",\"\",Teilereingabe!D83)","v":""},{"$f":"IF(Teilereingabe!E83=\"\",\"\",Teilereingabe!E83)","v":""},{"$f":"IF(Teilereingabe!F83=\"\",\"\",Teilereingabe!F83)","v":""},{"$f":"IF(Teilereingabe!G83=\"\",\"\",Teilereingabe!G83)","v":""}]
[null,null,null,null,null,null,null,null,null,null,null,null,null,null,{"$f":"IF(Teilereingabe!D84=\"\",\"\",Teilereingabe!D84)","v":""},{"$f":"IF(Teilereingabe!E84=\"\",\"\",Teilereingabe!E84)","v":""},{"$f":"IF(Teilereingabe!F84=\"\",\"\",Teilereingabe!F84)","v":""},{"$f":"IF(Teilereingabe!G84=\"\",\"\",Teilereingabe!G84)","v":""}]
[null,null,null,null,null,null,null,null,null,null,null,null,null,null,{"$f":"IF(Teilereingabe!D85=\"\",\"\",Teilereingabe!D85)","v":""},{"$f":"IF(Teilereingabe!E85=\"\",\"\",Teilereingabe!E85)","v":""},{"$f":"IF(Teilereingabe!F85=\"\",\"\",Teilereingabe!F85)","v":""},{"$f":"IF(Teilereingabe!G85=\"\",\"\",Teilereingabe!G85)","v":""}]
[null,null,null,null,null,null,null,null,null,null,null,null,null,null,{"$f":"IF(Teilereingabe!D86=\"\",\"\",Teilereingabe!D86)","v":""},{"$f":"IF(Teilereingabe!E86=\"\",\"\",Teilereingabe!E86)","v":""},{"$f":"IF(Teilereingabe!F86=\"\",\"\",Teilereingabe!F86)","v":""},{"$f":"IF(Teilereingabe!G86=\"\",\"\",Teilereingabe!G86)","v":""}]
[null,null,null,null,null,null,null,null,null,null,null,null,null,null,{"$f":"IF(Teilereingabe!D87=\"\",\"\",Teilereingabe!D87)","v":""},{"$f":"IF(Teilereingabe!E87=\"\",\"\",Teilereingabe!E87)","v":""},{"$f":"IF(Teilereingabe!F87=\"\",\"\",Teilereingabe!F87)","v":""},{"$f":"IF(Teilereingabe!G87=\"\",\"\",Teilereingabe!G87)","v":""}]
[null,null,null,null,null,null,null,null,null,null,null,null,null,null,{"$f":"IF(Teilereingabe!D88=\"\",\"\",Teilereingabe!D88)","v":""},{"$f":"IF(Teilereingabe!E88=\"\",\"\",Teilereingabe!E88)","v":""},{"$f":"IF(Teilereingabe!F88=\"\",\"\",Teilereingabe!F88)","v":""},{"$f":"IF(Teilereingabe!G88=\"\",\"\",Teilereingabe!G88)","v":""}]
[null,null,null,null,null,null,null,null,null,null,null,null,null,null,{"$f":"IF(Teilereingabe!D89=\"\",\"\",Teilereingabe!D89)","v":""},{"$f":"IF(Teilereingabe!E89=\"\",\"\",Teilereingabe!E89)","v":""},{"$f":"IF(Teilereingabe!F89=\"\",\"\",Teilereingabe!F89)","v":""},{"$f":"IF(Teilereingabe!G89=\"\",\"\",Teilereingabe!G89)","v":""}]
[null,null,null,null,null,null,null,null,null,null,null,null,null,null,{"$f":"IF(Teilereingabe!D90=\"\",\"\",Teilereingabe!D90)","v":""},{"$f":"IF(Teilereingabe!E90=\"\",\"\",Teilereingabe!E90)","v":""},{"$f":"IF(Teilereingabe!F90=\"\",\"\",Teilereingabe!F90)","v":""},{"$f":"IF(Teilereingabe!G90=\"\",\"\",Teilereingabe!G90)","v":""}]
[null,null,null,null,null,null,null,null,null,null,null,null,null,null,{"$f":"IF(Teilereingabe!D91=\"\",\"\",Teilereingabe!D91)","v":""},{"$f":"IF(Teilereingabe!E91=\"\",\"\",Teilereingabe!E91)","v":""},{"$f":"IF(Teilereingabe!F91=\"\",\"\",Teilereingabe!F91)","v":""},{"$f":"IF(Teilereingabe!G91=\"\",\"\",Teilereingabe!G91)","v":""}]
[null,null,null,null,null,null,null,null,null,null,null,null,null,null,{"$f":"IF(Teilereingabe!D92=\"\",\"\",Teilereingabe!D92)","v":""},{"$f":"IF(Teilereingabe!E92=\"\",\"\",Teilereingabe!E92)","v":""},{"$f":"IF(Teilereingabe!F92=\"\",\"\",Teilereingabe!F92)","v":""},{"$f":"IF(Teilereingabe!G92=\"\",\"\",Teilereingabe!G92)","v":""}]
[null,null,null,null,null,null,null,null,null,null,null,null,null,null,{"$f":"IF(Teilereingabe!D93=\"\",\"\",Teilereingabe!D93)","v":""},{"$f":"IF(Teilereingabe!E93=\"\",\"\",Teilereingabe!E93)","v":""},{"$f":"IF(Teilereingabe!F93=\"\",\"\",Teilereingabe!F93)","v":""},{"$f":"IF(Teilereingabe!G93=\"\",\"\",Teilereingabe!G93)","v":""}]
[null,null,null,null,null,null,null,null,null,null,null,null,null,null,{"$f":"IF(Teilereingabe!D94=\"\",\"\",Teilereingabe!D94)","v":""},{"$f":"IF(Teilereingabe!E94=\"\",\"\",Teilereingabe!E94)","v":""},{"$f":"IF(Teilereingabe!F94=\"\",\"\",Teilereingabe!F94)","v":""},{"$f":"IF(Teilereingabe!G94=\"\",\"\",Teilereingabe!G94)","v":""}]
[null,null,null,null,null,null,null,null,null,null,null,null,null,null,{"$f":"IF(Teilereingabe!D95=\"\",\"\",Teilereingabe!D95)","v":""},{"$f":"IF(Teilereingabe!E95=\"\",\"\",Teilereingabe!E95)","v":""},{"$f":"IF(Teilereingabe!F95=\"\",\"\",Teilereingabe!F95)","v":""},{"$f":"IF(Teilereingabe!G95=\"\",\"\",Teilereingabe!G95)","v":""}]
[null,null,null,null,null,null,null,null,null,null,null,null,null,null,{"$f":"IF(Teilereingabe!D96=\"\",\"\",Teilereingabe!D96)","v":""},{"$f":"IF(Teilereingabe!E96=\"\",\"\",Teilereingabe!E96)","v":""},{"$f":"IF(Teilereingabe!F96=\"\",\"\",Teilereingabe!F96)","v":""},{"$f":"IF(Teilereingabe!G96=\"\",\"\",Teilereingabe!G96)","v":""}]
[null,null,null,null,null,null,null,null,null,null,null,null,null,null,{"$f":"IF(Teilereingabe!D97=\"\",\"\",Teilereingabe!D97)","v":""},{"$f":"IF(Teilereingabe!E97=\"\",\"\",Teilereingabe!E97)","v":""},{"$f":"IF(Teilereingabe!F97=\"\",\"\",Teilereingabe!F97)","v":""},{"$f":"IF(Teilereingabe!G97=\"\",\"\",Teilereingabe!G97)","v":""}]
[null,null,null,null,null,null,null,null,null,null,null,null,null,null,{"$f":"IF(Teilereingabe!D98=\"\",\"\",Teilereingabe!D98)","v":""},{"$f":"IF(Teilereingabe!E98=\"\",\"\",Teilereingabe!E98)","v":""},{"$f":"IF(Teilereingabe!F98=\"\",\"\",Teilereingabe!F98)","v":""},{"$f":"IF(Teilereingabe!G98=\"\",\"\",Teilereingabe!G98)","v":""}]
[null,null,null,null,null,null,null,null,null,null,null,null,null,null,{"$f":"IF(Teilereingabe!D99=\"\",\"\",Teilereingabe!D99)","v":""},{"$f":"IF(Teilereingabe!E99=\"\",\"\",Teilereingabe!E99)","v":""},{"$f":"IF(Teilereingabe!F99=\"\",\"\",Teilereingabe!F99)","v":""},{"$f":"IF(Teilereingabe!G99=\"\",\"\",Teilereingabe!G99)","v":""}]
[null,null,null,null,null,null,null,null,null,null,null,null,null,null,{"$f":"IF(Teilereingabe!D100=\"\",\"\",Teilereingabe!D100)","v":""},{"$f":"IF(Teilereingabe!E100=\"\",\"\",Teilereingabe!E100)","v":""},{"$f":"IF(Teilereingabe!F100=\"\",\"\",Teilereingabe!F100)","v":""},{"$f":"IF(Teilereingabe!G100=\"\",\"\",Teilereingabe!G100)","v":""}]
[null,null,null,null,null,null,null,null,null,null,null,null,null,null,{"$f":"IF(Teilereingabe!D101=\"\",\"\",Teilereingabe!D101)","v":""},{"$f":"IF(Teilereingabe!E101=\"\",\"\",Teilereingabe!E101)","v":""},{"$f":"IF(Teilereingabe!F101=\"\",\"\",Teilereingabe!F101)","v":""},{"$f":"IF(Teilereingabe!G101=\"\",\"\",Teilereingabe!G101)","v":""}]
[null,null,null,null,null,null,null,null,null,null,null,null,null,null,{"$f":"IF(Teilereingabe!D102=\"\",\"\",Teilereingabe!D102)","v":""},{"$f":"IF(Teilereingabe!E102=\"\",\"\",Teilereingabe!E102)","v":""},{"$f":"IF(Teilereingabe!F102=\"\",\"\",Teilereingabe!F102)","v":""},{"$f":"IF(Teilereingabe!G102=\"\",\"\",Teilereingabe!G102)","v":""}]

{"sheet":"D","index":9,"n_rows":101,"n_cols":18,"rows_kept":101,"cut":false,"hidden":false,"merged":[]}
["Ergebnisse pro Disziplin:",null,"Schützen Standauflage",null,"Bester Einzelschütze:",null,null,null,null,null,null,null,null,null,"Preisschießen"]
["Verein:","Ringe:","Teiler:",null,"Platz:","Verein:","Name:","Ringe:","Teiler:",null,"Königsschießen","Name:","Teiler",null,"Start\nNummer:","Name:","Verein:","Teiler:"]
["Soderstorf keine Teilnahme",0,0,null,"1.","","",0,"",null,"","","",null,"","","",""]
["Wetzen keine Teilnahme",0,0,null,"2.","","",0,"",null,"","","",null,"","","",""]
["Eyendorf keine Teilnahme",0,0,null,"3.","","",0,"",null,"","","",null,"","","",""]
["Raven-Rolfsen keine Teilnahme",0,0,null,"4.","","",0,"",null,"","","",null,"","","",""]
[null,null,null,null,null,null,null,null,null,null,null,null,null,null,"","","",""]
[null,null,"Damen",null,null,null,null,null,null,null,null,null,null,null,"","","",""]
["Soderstorf keine Teilnahme",0,0,null,"1.","","",0,"",null,"Königinenschießen","Name:","Teiler",null,"","","",""]
["Wetzen keine Teilnahme",0,0,null,"2.","","",0,"",null,"","","",null,"","","",""]
["Eyendorf keine Teilnahme",0,0,null,"3.","","",0,"",null,"","","",null,"","","",""]
["Raven-Rolfsen keine Teilnahme",0,0,null,"4.","","",0,"",null,"","","",null,"","","",""]
[null,null,null,null,null,null,null,null,null,null,"","","",null,"","","",""]
[null,null,"Altersklasse Auflage",null,null,null,null,null,null,null,null,null,null,null,"","","",""]
["Soderstorf keine Teilnahme",0,0,null,"1.","","",0,"",null,null,null,null,null,"","","",""]
["Wetzen keine Teilnahme",0,0,null,"2.","","",0,"",null,null,null,null,null,"","","",""]
["Eyendorf keine Teilnahme",0,0,null,"3.","","",0,"",null,null,null,null,null,"","","",""]
["Raven-Rolfsen keine Teilnahme",0,0,null,"4.","","",0,"",null,null,null,null,null,"","","",""]
[null,null,null,null,null,null,null,null,null,null,null,null,null,null,"","","",""]
[null,null,"Freihand",null,null,null,null,null,null,null,null,null,null,null,"","","",""]
["Soderstorf keine Teilnahme",0,0,null,"1.","","",0,"",null,null,null,null,null,"","","",""]
["Wetzen keine Teilnahme",0,0,null,"2.","","",0,"",null,null,null,null,null,"","","",""]
["Eyendorf keine Teilnahme",0,0,null,"3.","","",0,"",null,null,null,null,null,"","","",""]
["Raven-Rolfsen keine Teilnahme",0,0,null,"4.","","",0,"",null,null,null,null,null,"","","",""]
[null,null,null,null,null,null,null,null,null,null,null,null,null,null,"","","",""]
[null,null,"Jugend",null,null,null,null,null,null,null,null,null,null,null,"","","",""]
["Soderstorf keine Teilnahme",0,0,null,"1.","","",0,"",null,null,null,null,null,"","","",""]
["Wetzen keine Teilnahme",0,0,null,"2.","","",0,"",null,null,null,null,null,"","","",""]
["Eyendorf keine Teilnahme",0,0,null,"3.","","",0,"",null,null,null,null,null,"","","",""]
["Raven-Rolfsen keine Teilnahme",0,0,null,"4.","","",0,"",null,null,null,null,null,"","","",""]
[null,null,null,null,null,null,null,null,null,null,null,null,null,null,"","","",""]
[null,null,null,null,null,null,null,null,null,null,null,null,null,null,"","","",""]
[null,null,null,null,null,null,null,null,null,null,null,null,null,null,"","","",""]
[null,null,null,null,null,null,null,null,null,null,null,null,null,null,"","","",""]
[null,null,null,null,null,null,null,null,null,null,null,null,null,null,"","","",""]
[null,null,null,null,null,null,null,null,null,null,null,null,null,null,"","","",""]
[null,null,null,null,null,null,null,null,null,null,null,null,null,null,"","","",""]
[null,null,null,null,null,null,null,null,null,null,null,null,null,null,"","","",""]
[null,null,null,null,null,null,null,null,null,null,null,null,null,null,"","","",""]
[null,null,null,null,null,null,null,null,null,null,null,null,null,null,"","","",""]
[null,null,null,null,null,null,null,null,null,null,null,null,null,null,"","","",""]
[null,null,null,null,null,null,null,null,null,null,null,null,null,null,"","","",""]
[null,null,null,null,null,null,null,null,null,null,null,null,null,null,"","","",""]
[null,null,null,null,null,null,null,null,null,null,null,null,null,null,"","","",""]
[null,null,null,null,null,null,null,null,null,null,null,null,null,null,"","","",""]
[null,null,null,null,null,null,null,null,null,null,null,null,null,null,"","","",""]
[null,null,null,null,null,null,null,null,null,null,null,null,null,null,"","","",""]
[null,null,null,null,null,null,null,null,null,null,null,null,null,null,"","","",""]
[null,null,null,null,null,null,null,null,null,null,null,null,null,null,"","","",""]
[null,null,null,null,null,null,null,null,null,null,null,null,null,null,"","","",""]
[null,null,null,null,null,null,null,null,null,null,null,null,null,null,"","","",""]
[null,null,null,null,null,null,null,null,null,null,null,null,null,null,"","","",""]
[null,null,null,null,null,null,null,null,null,null,null,null,null,null,"","","",""]
[null,null,null,null,null,null,null,null,null,null,null,null,null,null,"","","",""]
[null,null,null,null,null,null,null,null,null,null,null,null,null,null,"","","",""]
[null,null,null,null,null,null,null,null,null,null,null,null,null,null,"","","",""]
[null,null,null,null,null,null,null,null,null,null,null,null,null,null,"","","",""]
[null,null,null,null,null,null,null,null,null,null,null,null,null,null,"","","",""]
[null,null,null,null,null,null,null,null,null,null,null,null,null,null,"","","",""]
[null,null,null,null,null,null,null,null,null,null,null,null,null,null,"","","",""]
[null,null,null,null,null,null,null,null,null,null,null,null,null,null,"","","",""]
[null,null,null,null,null,null,null,null,null,null,null,null,null,null,"","","",""]
[null,null,null,null,null,null,null,null,null,null,null,null,null,null,"","","",""]
[null,null,null,null,null,null,null,null,null,null,null,null,null,null,"","","",""]
[null,null,null,null,null,null,null,null,null,null,null,null,null,null,"","","",""]
[null,null,null,null,null,null,null,null,null,null,null,null,null,null,"","","",""]
[null,null,null,null,null,null,null,null,null,null,null,null,null,null,"","","",""]
[null,null,null,null,null,null,null,null,null,null,null,null,null,null,"","","",""]
[null,null,null,null,null,null,null,null,null,null,null,null,null,null,"","","",""]
[null,null,null,null,null,null,null,null,null,null,null,null,null,null,"","","",""]
[null,null,null,null,null,null,null,null,null,null,null,null,null,null,"","","",""]
[null,null,null,null,null,null,null,null,null,null,null,null,null,null,"","","",""]
[null,null,null,null,null,null,null,null,null,null,null,null,null,null,"","","",""]
[null,null,null,null,null,null,null,null,null,null,null,null,null,null,"","","",""]
[null,null,null,null,null,null,null,null,null,null,null,null,null,null,"","","",""]
[null,null,null,null,null,null,null,null,null,null,null,null,null,null,"","","",""]
[null,null,null,null,null,null,null,null,null,null,null,null,null,null,"","","",""]
[null,null,null,null,null,null,null,null,null,null,null,null,null,null,"","","",""]
[null,null,null,null,null,null,null,null,null,null,null,null,null,null,"","","",""]
[null,null,null,null,null,null,null,null,null,null,null,null,null,null,"","","",""]
[null,null,null,null,null,null,null,null,null,null,null,null,null,null,"","","",""]
[null,null,null,null,null,null,null,null,null,null,null,null,null,null,"","","",""]
[null,null,null,null,null,null,null,null,null,null,null,null,null,null,"","","",""]
[null,null,null,null,null,null,null,null,null,null,null,null,null,null,"","","",""]
[null,null,null,null,null,null,null,null,null,null,null,null,null,null,"","","",""]
[null,null,null,null,null,null,null,null,null,null,null,null,null,null,"","","",""]
[null,null,null,null,null,null,null,null,null,null,null,null,null,null,"","","",""]
[null,null,null,null,null,null,null,null,null,null,null,null,null,null,"","","",""]
[null,null,null,null,null,null,null,null,null,null,null,null,null,null,"","","",""]
[null,null,null,null,null,null,null,null,null,null,null,null,null,null,"","","",""]
[null,null,null,null,null,null,null,null,null,null,null,null,null,null,"","","",""]
[null,null,null,null,null,null,null,null,null,null,null,null,null,null,"","","",""]
[null,null,null,null,null,null,null,null,null,null,null,null,null,null,"","","",""]
[null,null,null,null,null,null,null,null,null,null,null,null,null,null,"","","",""]
[null,null,null,null,null,null,null,null,null,null,null,null,null,null,"","","",""]
[null,null,null,null,null,null,null,null,null,null,null,null,null,null,"","","",""]
[null,null,null,null,null,null,null,null,null,null,null,null,null,null,"","","",""]
[null,null,null,null,null,null,null,null,null,null,null,null,null,null,"","","",""]
[null,null,null,null,null,null,null,null,null,null,null,null,null,null,"","","",""]
[null,null,null,null,null,null,null,null,null,null,null,null,null,null,"","","",""]
[null,null,null,null,null,null,null,null,null,null,null,null,null,null,"","","",""]

{"sheet":"Orden u. Becher","index":10,"n_rows":0,"n_cols":0,"rows_kept":0,"cut":false,"hidden":false,"merged":[]}

{"sheet":"Satzung","index":11,"n_rows":0,"n_cols":0,"rows_kept":0,"cut":false,"hidden":false,"merged":[]}

{"sheet":"allgemeine Bedingungen","index":12,"n_rows":0,"n_cols":0,"rows_kept":0,"cut":false,"hidden":false,"merged":[]}

{"sheet":"Preisgeldaufteilung","index":13,"n_rows":19,"n_cols":12,"rows_kept":19,"cut":false,"hidden":false,"merged":[[15,5,15,6],[13,7,13,8],[15,7,15,8],[6,5,6,6],[6,7,6,8],[13,5,13,6],[9,5,9,6],[9,7,9,8],[10,5,10,6],[10,7,10,8],[12,5,12,6],[12,7,12,8],[0,0,0,5],[2,5,2,6],[5,5,5,6],[5,7,5,8],[7,5,7,6],[7,7,7,8],[3,7,3,8]]}
["Preisgeldaufteilung"]
[]
[null,null,"Platz","€URO",null,"Preisgeld zur Verteilung"]
[null,null,1,50,null,{"$f":"Preisteilnehmer!G6","v":60},{"$f":"Preisteilnehmer!H6","v":0},"<== Vorschlagswert"]
[null,null,2,40]
[null,null,3,30,null,"Preis pro Satz",null,{"$f":"Preisteilnehmer!H4","v":8}]
[null,null,4,25,null,"Preis für Bestmann",null,20,null,"<== bitte eingeben !"]
[null,null,5,20,null,"Teilnehmer Preisschießen",null,{"$f":"COUNTA(Preisteilnehmer!E8:E107)","v":0}]
[null,null,6,15]
[null,null,7,10,null,"Startkapital Kasse:",null,150,null,"<== bitte eingeben !"]
[null,null,8,10,null,"Gesamteinnahmen:",null,{"$f":"IF(Preisteilnehmer!G4=\"\",\"\",Preisteilnehmer!G4)","v":0}]
[null,null,9,10,null,null,null,null,null,null,"Ja"]
[null,null,10,10,null,"Preisgeld Ausgabe:",null,{"$f":"IF(K13=\"x\",D19,\"\")","v":220},null,null,"x","<== Preisgeldaufteilung OK, dann \"x\" bei ja eingeben!"]
[null,null,11,null,null,"Bestmann Ausgabe:",null,{"$f":"IF(K14=\"x\",H7*5,\"\")","v":100},null,null,"x","<== Bestmann mit rechnen \"x\" bei ja eingeben!"]
[null,null,12]
[null,null,13,null,null,"IST - Kassenbestand:",null,{"$f":"IF(H10,SUM(H10:I11)-SUM(H13:I14),\"\")","v":-170}]
[null,null,14]
[null,null,15]
[null,null,"Summe:",{"$f":"SUM(D4:D18)","v":220}]